program: Orca
programVersion: 5.0.2
elementType: S P O O O O O N C C C C C C C C H H H H H H H H H H
charge: 0
multiplicity: 1
keywords: wb97x-d3
keywords: def2-TZVPP
keywords: def2/J RIJCOSX
keywords: DEFGRID2
keywords: scfconv7
keywords: smallprint printgap noloewdin
keywords: NOSOSCF
formula: C8H10NO5PS
InChI: InChI=1/C8H10NO5PS/c1-12-15(16,13-2)14-8-5-3-7(4-6-8)9(10)11/h3-6H,1-2H3
26 atoms
S  -2.109941 -0.080655 2.034723
P  -2.251787 -0.315537 0.143706
O  -0.999869 -1.088304 -0.564117
O  -3.435997 -1.25784 -0.314229
O  -2.409946 0.997874 -0.745767
O  4.683354 1.437524 -0.71441
O  4.87378 0.199015 1.011642
N  4.240072 0.646421 0.084808
C  0.283547 -0.645163 -0.39903
C  0.809899 0.280298 -1.289411
C  1.042691 -1.152945 0.645779
C  2.869303 0.198284 -0.084661
C  2.116061 0.705762 -1.133461
C  2.348731 -0.730945 0.804692
C  -3.845961 -1.41191 -1.682199
C  -2.194513 2.324497 -0.25148
H  0.20945 0.659901 -2.105382
H  0.619027 -1.878986 1.3259
H  2.52828 1.423286 -1.827921
H  2.940279 -1.126613 1.617496
H  -3.010746 -1.683903 -2.32757
H  -4.314991 -0.500552 -2.051244
H  -4.576628 -2.216639 -1.692922
H  -2.56362 3.001146 -1.018515
H  -1.134178 2.512375 -0.084501
H  -2.743065 2.498055 0.67362
elementType: S P O N C H
totalener: -1481.39805600 hartree
nucrepener: 1405.94425805 hartree
electener: -2887.34231405 hartree
oneelecener: -4830.13854780 hartree
twoeener: 1942.79623375 hartree
cpcmener: -0.02422259 hartree
kineticenergy: 1477.01593557 hartree
xcener: -103.838919176022 hartree
chargesum: -0.0000000
charge: -0.419785 0.736524 -0.346571 -0.336754 -0.338208 -0.383810 -0.383080 0.531188 0.256013 -0.157357 -0.143735 0.045785 -0.109659 -0.113702 -0.115252 -0.100123 0.160210 0.152046 0.164967 0.165037 0.124877 0.117414 0.127767 0.130068 0.119839 0.116303
qa: -0.4198 0.7365 -0.3466 -0.3368 -0.3382 -0.3838 -0.3831 0.5312 0.2560 -0.1574 -0.1437 0.0458 -0.1097 -0.1137 -0.1153 -0.1001 0.1602 0.1520 0.1650 0.1650 0.1249 0.1174 0.1278 0.1301 0.1198 0.1163
va: 2.0249 5.4956 2.0810 2.1315 2.0572 1.8741 1.8745 4.1620 3.7780 3.9964 4.0220 3.7634 4.0303 4.0426 3.8453 3.8269 0.9996 1.0055 1.0120 1.0117 0.9903 0.9924 0.9890 0.9905 0.9844 1.0040
dispcorr: -0.011525180 hartree
energy: -1481.409581182171
dipole: -8.98426 6.88603 -2.09823 2.85204 -2.66072 0.19133 -7.27908 5.22759 -2.05149
magnitude: 2.94072 au
magnitude: 7.47470 debye
