program: Orca
programVersion: 5.0.2
elementType: S P O O O O O N C C C C C C C C H H H H H H H H H H
charge: 0
multiplicity: 1
keywords: wb97x-d3
keywords: def2-TZVPP
keywords: def2/J RIJCOSX
keywords: DEFGRID2
keywords: scfconv7
keywords: smallprint printgap noloewdin
keywords: NOSOSCF
formula: C8H10NO5PS
InChI: InChI=1/C8H10NO5PS/c1-12-15(16,13-2)14-8-5-3-7(4-6-8)9(10)11/h3-6H,1-2H3
26 atoms
S  -1.89121 -0.019257 2.084335
P  -2.247729 -0.100768 0.209545
O  -1.075569 0.519491 -0.745117
O  -2.493527 -1.576883 -0.311931
O  -3.495343 0.69374 -0.371605
O  4.906127 -1.155595 -0.474214
O  4.944632 0.550691 0.804972
N  4.367195 -0.228817 0.083892
C  0.25451 0.312561 -0.510687
C  0.897291 -0.749732 -1.130251
C  0.945971 1.193726 0.308672
C  2.942094 -0.043249 -0.120398
C  2.254333 -0.928122 -0.93887
C  2.301921 1.017643 0.505078
C  -2.943508 -1.881445 -1.641268
C  -3.629085 2.106333 -0.170968
H  0.345772 -1.426402 -1.769859
H  0.431167 2.018699 0.781411
H  2.757602 -1.751027 -1.425201
H  2.842255 1.704226 1.140541
H  -2.38923 -1.328559 -2.399842
H  -4.007689 -1.672328 -1.742702
H  -2.774487 -2.945473 -1.785745
H  -2.90894 2.65478 -0.778162
H  -3.496648 2.370915 0.878957
H  -4.63578 2.373874 -0.480671
elementType: S P O N C H
totalener: -1481.39997101 hartree
nucrepener: 1400.38779326 hartree
electener: -2881.78776427 hartree
oneelecener: -4819.10566077 hartree
twoeener: 1937.31789650 hartree
cpcmener: -0.02585379 hartree
kineticenergy: 1477.01313042 hartree
xcener: -103.837195900337 hartree
chargesum: -0.0000000
charge: -0.415807 0.726523 -0.352996 -0.337477 -0.327694 -0.383737 -0.383911 0.531560 0.247302 -0.126656 -0.132185 0.051309 -0.124797 -0.117214 -0.124971 -0.103648 0.159523 0.149109 0.162923 0.163867 0.122124 0.127091 0.130317 0.124796 0.105694 0.128956
qa: -0.4158 0.7265 -0.3530 -0.3375 -0.3277 -0.3837 -0.3839 0.5316 0.2473 -0.1267 -0.1322 0.0513 -0.1248 -0.1172 -0.1250 -0.1036 0.1595 0.1491 0.1629 0.1639 0.1221 0.1271 0.1303 0.1248 0.1057 0.1290
va: 2.0351 5.5133 2.0560 2.1188 2.0954 1.8742 1.8736 4.1627 3.7886 4.0268 4.0130 3.7500 4.0589 4.0485 3.8429 3.8347 0.9914 1.0044 1.0140 1.0120 0.9890 0.9932 0.9890 0.9902 1.0023 0.9894
dispcorr: -0.011450007 hartree
energy: -1481.411421018654
dipole: -10.78299 8.22713 -2.55586 2.21231 -1.48495 0.72736 -7.53349 5.32317 -2.21032
magnitude: 3.45644 au
magnitude: 8.78558 debye
