program: Orca
programVersion: 5.0.2
elementType: S P O O O O O N C C C C C C C C H H H H H H H H H H
charge: 0
multiplicity: 1
keywords: wb97x-d3
keywords: def2-TZVPP
keywords: def2/J RIJCOSX
keywords: DEFGRID2
keywords: scfconv7
keywords: smallprint printgap noloewdin
keywords: NOSOSCF
formula: C8H10NO5PS
InChI: InChI=1/C8H10NO5PS/c1-12-15(16,13-2)14-8-5-3-7(4-6-8)9(10)11/h3-6H,1-2H3
26 atoms
S  -2.205998 -0.625754 1.791635
P  -2.215026 -0.018541 -0.022328
O  -0.925081 0.848621 -0.489859
O  -2.246404 -1.109944 -1.179013
O  -3.376661 0.967993 -0.465586
O  4.886539 -1.292928 0.183443
O  5.25149 0.80498 0.065071
N  4.508539 -0.14902 0.079316
C  0.386349 0.540705 -0.307973
C  0.857269 -0.763759 -0.20956
C  1.264048 1.618257 -0.261837
C  3.084956 0.092083 -0.042158
C  2.214388 -0.986334 -0.073988
C  2.619759 1.396962 -0.135046
C  -3.229993 -2.151873 -1.174559
C  -3.941526 1.938339 0.423177
H  0.1952 -1.616567 -0.256748
H  0.882952 2.628169 -0.334327
H  2.57497 -2.00222 -0.004703
H  3.294935 2.239916 -0.106845
H  -4.230741 -1.743661 -1.318013
H  -3.197492 -2.72068 -0.244779
H  -2.989788 -2.81011 -2.005234
H  -3.228761 2.735683 0.633167
H  -4.261193 1.47881 1.358536
H  -4.807491 2.35498 -0.085159
elementType: S P O N C H
totalener: -1481.40022190 hartree
nucrepener: 1389.56052317 hartree
electener: -2870.96074507 hartree
oneelecener: -4797.54183381 hartree
twoeener: 1926.58108874 hartree
cpcmener: -0.02258604 hartree
kineticenergy: 1477.02329644 hartree
xcener: -103.841908041371 hartree
chargesum: -0.0000000
charge: -0.428458 0.742025 -0.304535 -0.332760 -0.336106 -0.386560 -0.386827 0.530339 0.251816 -0.113264 -0.159936 0.035888 -0.135509 -0.105496 -0.112954 -0.113856 0.137991 0.152746 0.163416 0.163898 0.128701 0.110518 0.129757 0.128144 0.112036 0.128989
qa: -0.4285 0.7420 -0.3045 -0.3328 -0.3361 -0.3866 -0.3868 0.5303 0.2518 -0.1133 -0.1599 0.0359 -0.1355 -0.1055 -0.1130 -0.1139 0.1380 0.1527 0.1634 0.1639 0.1287 0.1105 0.1298 0.1281 0.1120 0.1290
va: 2.0076 5.5014 2.1724 2.0965 2.1155 1.8712 1.8698 4.1608 3.8337 3.9316 3.9975 3.7748 4.1001 4.0437 3.8341 3.8361 1.0211 1.0034 1.0150 1.0112 0.9902 1.0008 0.9896 0.9852 1.0009 0.9904
dispcorr: -0.010651512 hartree
energy: -1481.410873411612
dipole: -12.81636 9.75316 -3.06319 0.49729 0.00114 0.49843 -2.40384 1.55141 -0.85243
magnitude: 3.21842 au
magnitude: 8.18057 debye
