program: Orca
programVersion: 5.0.2
elementType: S P O O O O O N C C C C C C C C H H H H H H H H H H
charge: 0
multiplicity: 1
keywords: wb97x-d3
keywords: def2-TZVPP
keywords: def2/J RIJCOSX
keywords: DEFGRID2
keywords: scfconv7
keywords: smallprint printgap noloewdin
keywords: NOSOSCF
formula: C8H10NO5PS
InChI: InChI=1/C8H10NO5PS/c1-12-15(16,13-2)14-8-5-3-7(4-6-8)9(10)11/h3-6H,1-2H3
26 atoms
S  -2.17993 -0.662289 2.012866
P  -2.326413 -0.034132 0.229775
O  -1.054292 -0.352502 -0.753107
O  -3.481248 -0.616719 -0.701135
O  -2.548426 1.533442 0.096274
O  5.139888 -0.428913 -0.597515
O  4.7863 1.071973 0.886907
N  4.413533 0.261109 0.075221
C  0.263351 -0.17841 -0.477543
C  1.148313 -0.956442 -1.216102
C  0.738844 0.741869 0.449987
C  2.976964 0.106008 -0.112941
C  2.508986 -0.814434 -1.03852
C  2.103104 0.880673 0.631501
C  -3.735173 -2.015796 -0.772472
C  -2.701191 2.19919 -1.156775
H  0.762057 -1.669274 -1.931615
H  0.065242 1.352766 1.034265
H  3.197379 -1.415972 -1.613242
H  2.478157 1.59307 1.351217
H  -3.785332 -2.458116 0.22295
H  -2.963704 -2.521948 -1.353615
H  -4.693578 -2.137646 -1.269616
H  -3.640719 1.925047 -1.63447
H  -1.875293 1.981977 -1.834874
H  -2.707661 3.264097 -0.94091
totalener: -1481.38559614 hartree
nucrepener: 1395.63869159 hartree
electener: -2877.02428773 hartree
oneelecener: -4809.43395997 hartree
twoeener: 1932.40967225 hartree
kineticenergy: 1477.06259433 hartree
xcener: -103.846767805100 hartree
chargesum: -0.0000000
charge: -0.329238 0.678482 -0.313426 -0.318764 -0.308394 -0.338219 -0.335783 0.493430 0.219273 -0.133084 -0.065138 -0.023722 -0.100909 -0.125202 -0.119470 -0.130779 0.126127 0.118423 0.155214 0.156037 0.110679 0.113393 0.117548 0.120986 0.109950 0.122589
qa: -0.3292 0.6785 -0.3134 -0.3188 -0.3084 -0.3382 -0.3358 0.4934 0.2193 -0.1331 -0.0651 -0.0237 -0.1009 -0.1252 -0.1195 -0.1308 0.1261 0.1184 0.1552 0.1560 0.1107 0.1134 0.1175 0.1210 0.1099 0.1226
va: 2.1195 5.5215 2.0985 2.1110 2.1081 1.9133 1.9179 4.1935 3.9161 4.0052 3.9050 3.9066 4.0722 4.0940 3.8674 3.8749 1.0113 1.0322 1.0170 1.0196 1.0044 0.9884 0.9904 0.9928 0.9907 0.9887
dispcorr: -0.011114784 hartree
energy: -1481.396710921635
dipole: -9.87399 7.86173 -2.01226 -0.01650 -0.04779 -0.06429 -7.86055 6.31158 -1.54897
magnitude: 2.54020 au
magnitude: 6.45668 debye
