program: Orca
programVersion: 5.0.2
elementType: S P O O O O O N C C C C C C C C H H H H H H H H H H
charge: 0
multiplicity: 1
keywords: wb97x-d3
keywords: def2-TZVPP
keywords: def2/J RIJCOSX
keywords: DEFGRID2
keywords: scfconv7
keywords: smallprint printgap noloewdin
keywords: NOSOSCF
formula: C8H10NO5PS
InChI: InChI=1/C8H10NO5PS/c1-12-15(16,13-2)14-8-5-3-7(4-6-8)9(10)11/h3-6H,1-2H3
26 atoms
S  -3.83783 -0.044317 1.200548
P  -2.205391 -0.130263 0.231059
O  -0.902833 -0.080985 1.190897
O  -1.873016 -1.436928 -0.621161
O  -1.960932 1.016586 -0.862312
O  4.923363 -1.013922 -0.792363
O  4.901016 1.123819 -0.691236
N  4.38276 0.040952 -0.570472
C  0.381383 -0.058042 0.718244
C  1.054589 -1.248461 0.485165
C  1.013578 1.16279 0.534914
C  2.994635 0.006344 -0.122514
C  2.370252 -1.217267 0.062463
C  2.32947 1.198565 0.114295
C  -2.821547 -1.942723 -1.556135
C  -2.490807 2.326327 -0.695754
H  0.553268 -2.192882 0.641729
H  0.483051 2.08294 0.737579
H  2.903046 -2.138736 -0.120009
H  2.829766 2.144899 -0.027637
H  -3.807862 -2.040268 -1.100116
H  -2.469401 -2.923994 -1.863076
H  -2.889054 -1.296677 -2.431861
H  -2.012174 2.85008 0.133658
H  -3.565515 2.29705 -0.515865
H  -2.287576 2.863618 -1.618549
totalener: -1481.38480437 hartree
nucrepener: 1400.04260818 hartree
electener: -2881.42741255 hartree
oneelecener: -4818.20181248 hartree
twoeener: 1936.77439993 hartree
kineticenergy: 1477.07033257 hartree
xcener: -103.845330277220 hartree
chargesum: 0.0000000
charge: -0.346496 0.670491 -0.317769 -0.308249 -0.318425 -0.333807 -0.335127 0.493056 0.222043 -0.093273 -0.102706 -0.009825 -0.110645 -0.124607 -0.121437 -0.118877 0.130348 0.125598 0.156710 0.155893 0.110977 0.114675 0.116167 0.102257 0.120812 0.122215
qa: -0.3465 0.6705 -0.3178 -0.3082 -0.3184 -0.3338 -0.3351 0.4931 0.2220 -0.0933 -0.1027 -0.0098 -0.1106 -0.1246 -0.1214 -0.1189 0.1303 0.1256 0.1567 0.1559 0.1110 0.1147 0.1162 0.1023 0.1208 0.1222
va: 2.1066 5.5449 2.1489 2.1149 2.0636 1.9185 1.9168 4.1935 3.8931 3.9952 4.0129 3.8987 4.0491 4.0885 3.8668 3.8612 1.0123 1.0038 1.0172 1.0194 1.0028 0.9913 0.9892 0.9870 1.0088 0.9897
dispcorr: -0.011143150 hartree
energy: -1481.395947520436
dipole: -7.41854 6.14578 -1.27276 1.87543 -1.66111 0.21433 -5.97284 5.29462 -0.67822
magnitude: 1.45802 au
magnitude: 3.70600 debye
