program: Orca
programVersion: 5.0.2
elementType: S P O O O O O N C C C C C C C C H H H H H H H H H H
charge: 0
multiplicity: 1
keywords: wb97x-d3
keywords: def2-TZVPP
keywords: def2/J RIJCOSX
keywords: DEFGRID2
keywords: scfconv7
keywords: smallprint printgap noloewdin
keywords: NOSOSCF
formula: C8H10NO5PS
InChI: InChI=1/C8H10NO5PS/c1-12-15(16,13-2)14-8-5-3-7(4-6-8)9(10)11/h3-6H,1-2H3
26 atoms
S  -2.268021 -0.663035 1.981141
P  -2.260198 0.083855 0.23365
O  -1.059772 1.112272 -0.150593
O  -2.123163 -0.940133 -0.993571
O  -3.519178 0.998325 -0.086004
O  4.889167 -0.352528 0.938717
O  4.834171 -0.571824 -1.189862
N  4.322949 -0.322958 -0.125698
C  0.252612 0.726851 -0.129144
C  0.88351 0.428933 -1.328291
C  0.942414 0.674358 1.073613
C  2.909007 0.040848 -0.126766
C  2.223424 0.089331 -1.330548
C  2.281873 0.330021 1.07469
C  -2.56086 -2.292074 -0.891863
C  -3.668045 1.723755 -1.30365
H  0.328051 0.472036 -2.254727
H  0.434805 0.904283 1.999621
H  2.725226 -0.13856 -2.259165
H  2.829347 0.286975 2.004488
H  -2.19933 -2.803137 -1.780515
H  -3.64894 -2.354921 -0.859743
H  -2.152384 -2.771811 -0.002807
H  -2.984669 2.571603 -1.340566
H  -4.690796 2.091341 -1.320576
H  -3.505846 1.090496 -2.176794
totalener: -1481.38496407 hartree
nucrepener: 1402.06883522 hartree
electener: -2883.45379928 hartree
oneelecener: -4822.42427344 hartree
twoeener: 1938.97047416 hartree
kineticenergy: 1477.06358612 hartree
xcener: -103.844820527250 hartree
chargesum: -0.0000000
charge: -0.348110 0.693110 -0.346517 -0.327765 -0.297320 -0.333263 -0.335957 0.493035 0.228510 -0.115017 -0.101690 -0.011236 -0.108766 -0.113415 -0.115394 -0.130596 0.123726 0.139347 0.156120 0.156930 0.114758 0.116767 0.116615 0.115444 0.122472 0.108213
qa: -0.3481 0.6931 -0.3465 -0.3278 -0.2973 -0.3333 -0.3360 0.4930 0.2285 -0.1150 -0.1017 -0.0112 -0.1088 -0.1134 -0.1154 -0.1306 0.1237 0.1393 0.1561 0.1569 0.1148 0.1168 0.1166 0.1154 0.1225 0.1082
va: 2.1054 5.5205 2.0968 2.0597 2.1369 1.9187 1.9162 4.1944 3.8567 4.0253 4.0279 3.8900 4.0505 4.0772 3.8620 3.8827 1.0131 1.0116 1.0173 1.0177 0.9914 0.9869 1.0057 0.9898 0.9903 0.9928
dispcorr: -0.011098412 hartree
energy: -1481.396062480134
dipole: -9.66915 7.85481 -1.81434 -0.69060 0.97399 0.28339 -7.83938 6.45552 -1.38387
magnitude: 2.29940 au
magnitude: 5.84460 debye
