program: Orca
programVersion: 5.0.2
elementType: S P O O O O O N C C C C C C C C H H H H H H H H H H
charge: 0
multiplicity: 1
keywords: wb97x-d3
keywords: def2-TZVPP
keywords: def2/J RIJCOSX
keywords: DEFGRID2
keywords: scfconv7
keywords: smallprint printgap noloewdin
keywords: NOSOSCF
formula: C8H10NO5PS
InChI: InChI=1/C8H10NO5PS/c1-12-15(16,13-2)14-8-5-3-7(4-6-8)9(10)11/h3-6H,1-2H3
26 atoms
S  -2.202378 -0.664343 1.745143
P  -2.21906 -0.023445 -0.050453
O  -0.935159 0.840692 -0.531942
O  -2.282676 -1.101416 -1.222973
O  -3.382797 0.98109 -0.463213
O  4.875207 -1.283217 0.201553
O  5.227627 0.827286 0.151806
N  4.504286 -0.138089 0.118915
C  0.375153 0.53727 -0.339293
C  0.850197 -0.763574 -0.224809
C  1.252031 1.61456 -0.296232
C  3.074638 0.097375 -0.034312
C  2.206619 -0.981131 -0.070078
C  2.606646 1.39764 -0.14723
C  -3.237569 -2.157424 -1.182535
C  -3.900546 1.941868 0.451477
H  0.182398 -1.611595 -0.265154
H  0.865719 2.620475 -0.385944
H  2.581163 -1.990186 0.016474
H  3.289529 2.233556 -0.117248
H  -4.245273 -1.778072 -1.355603
H  -3.208385 -2.679914 -0.225251
H  -2.975847 -2.847677 -1.980119
H  -3.183724 2.745694 0.622502
H  -4.156466 1.481533 1.406245
H  -4.796145 2.355212 -0.005077
totalener: -1481.38720213 hartree
nucrepener: 1391.21388262 hartree
electener: -2872.60108474 hartree
oneelecener: -4800.68142928 hartree
twoeener: 1928.08034453 hartree
kineticenergy: 1477.07210789 hartree
xcener: -103.848892461962 hartree
chargesum: 0.0000000
charge: -0.363620 0.684407 -0.296823 -0.312735 -0.314894 -0.336748 -0.337809 0.492568 0.230448 -0.066083 -0.131223 -0.022638 -0.125776 -0.098274 -0.125816 -0.120706 0.111319 0.127811 0.155240 0.154799 0.119545 0.111342 0.120228 0.113998 0.113458 0.117983
qa: -0.3636 0.6844 -0.2968 -0.3127 -0.3149 -0.3367 -0.3378 0.4926 0.2304 -0.0661 -0.1312 -0.0226 -0.1258 -0.0983 -0.1258 -0.1207 0.1113 0.1278 0.1552 0.1548 0.1195 0.1113 0.1202 0.1140 0.1135 0.1180
va: 2.0716 5.5425 2.1805 2.1011 2.1256 1.9166 1.9137 4.1936 3.9133 3.9213 3.9948 3.9101 4.1109 4.0662 3.8539 3.8606 1.0313 1.0119 1.0199 1.0172 0.9913 1.0042 0.9900 0.9874 1.0040 0.9906
dispcorr: -0.010611766 hartree
energy: -1481.397813893700
dipole: -12.64651 10.25295 -2.39356 0.50519 -0.14721 0.35797 -2.23756 1.62084 -0.61673
magnitude: 2.49752 au
magnitude: 6.34820 debye
