program: Orca
programVersion: 5.0.2
elementType: S S P O O O O C C C C C C H H H H H H H H H H H H H H H
charge: 0
multiplicity: 1
keywords: wb97x-d3
keywords: def2-TZVPP
keywords: def2/J RIJCOSX
keywords: DEFGRID2
keywords: scfconv7
keywords: smallprint printgap noloewdin
keywords: NOSOSCF
formula: C6H15O4PS2
InChI: InChI=1/C6H15O4PS2/c1-4-13(8)6-5-12-11(7,9-2)10-3/h4-6H2,1-3H3
28 atoms
S  -3.162139 -0.668061 0.660107
S  1.073949 0.402978 1.396724
P  1.521057 0.511125 -0.631556
O  2.245126 -0.841697 -1.043222
O  2.703391 1.57558 -0.668625
O  -3.071738 -1.981867 1.415855
O  0.350607 0.765557 -1.502835
C  -1.675628 0.288571 1.103162
C  -0.458758 -0.595705 1.288442
C  -2.757457 -1.032977 -1.074706
C  -3.035945 0.152276 -1.97875
C  3.438965 -1.315821 -0.406864
C  2.444652 2.981065 -0.530975
H  -1.539891 1.042314 0.328463
H  -1.911099 0.813908 2.029238
H  -0.511333 -1.138556 2.229958
H  -0.336395 -1.338982 0.501525
H  -1.724477 -1.376997 -1.146715
H  -3.403828 -1.874504 -1.328675
H  -4.087237 0.436584 -1.953556
H  -2.441935 1.028515 -1.722633
H  -2.788645 -0.115008 -3.005937
H  3.356902 -1.274328 0.680051
H  4.304249 -0.738647 -0.729609
H  3.565385 -2.351594 -0.709693
H  1.62724 3.298793 -1.176874
H  3.353765 3.49685 -0.827783
H  2.212206 3.23353 0.503658
elementType: S P O C H
totalener: -1676.50017395 hartree
nucrepener: 1301.19755253 hartree
electener: -2977.69772648 hartree
oneelecener: -4897.74612828 hartree
twoeener: 1920.04840180 hartree
cpcmener: -0.04159850 hartree
kineticenergy: 1671.86454843 hartree
xcener: -105.494676743271 hartree
chargesum: -0.0000000
charge: 0.478205 -0.192081 0.859389 -0.351828 -0.352757 -0.707618 -0.634494 -0.177269 -0.106014 -0.118320 -0.287489 -0.104139 -0.108731 0.124777 0.150878 0.139857 0.130913 0.106372 0.118271 0.100783 0.094355 0.106036 0.109574 0.124100 0.129526 0.120861 0.130645 0.116197
qa: 0.4782 -0.1921 0.8594 -0.3518 -0.3528 -0.7076 -0.6345 -0.1773 -0.1060 -0.1183 -0.2875 -0.1041 -0.1087 0.1248 0.1509 0.1399 0.1309 0.1064 0.1183 0.1008 0.0944 0.1060 0.1096 0.1241 0.1295 0.1209 0.1306 0.1162
va: 3.5244 2.2586 5.4858 2.0939 2.0963 1.6655 1.9691 3.8623 3.8527 3.8541 3.9698 3.8345 3.8442 1.0250 1.0074 1.0197 1.0195 1.0263 1.0159 1.0060 1.0062 0.9984 0.9996 0.9915 0.9892 0.9938 0.9901 0.9906
dispcorr: -0.012806800 hartree
energy: -1676.512980750187
dipole: -1.08479 3.11332 2.02854 2.03573 -0.45162 1.58411 -5.03144 4.91991 -0.11154
magnitude: 2.57620 au
magnitude: 6.54818 debye
