program: Orca
programVersion: 5.0.2
elementType: S S P O O O O C C C C C C H H H H H H H H H H H H H H H
charge: 0
multiplicity: 1
keywords: wb97x-d3
keywords: def2-TZVPP
keywords: def2/J RIJCOSX
keywords: DEFGRID2
keywords: scfconv7
keywords: smallprint printgap noloewdin
keywords: NOSOSCF
formula: C6H15O4PS2
InChI: InChI=1/C6H15O4PS2/c1-4-13(8)6-5-12-11(7,9-2)10-3/h4-6H2,1-3H3
28 atoms
S  -2.153806 -1.134822 -0.065021
S  0.563571 0.124431 1.402961
P  1.637021 0.954113 -0.178657
O  1.651458 -0.079087 -1.382476
O  3.14048 0.869974 0.343066
O  -1.186498 -1.683148 -1.100331
O  1.132634 2.277171 -0.611491
C  -1.865636 0.66174 0.057856
C  -1.020363 1.022078 1.258225
C  -3.766141 -1.040407 -0.894344
C  -4.217367 -2.422034 -1.319016
C  2.115906 -1.427691 -1.259901
C  3.608703 1.759052 1.366643
H  -1.421906 0.97598 -0.888287
H  -2.833118 1.15819 0.160051
H  -0.826864 2.092826 1.272947
H  -1.545286 0.778892 2.182293
H  -4.458866 -0.594791 -0.178384
H  -3.666585 -0.365943 -1.747114
H  -3.527819 -2.867344 -2.034207
H  -4.315288 -3.095283 -0.467328
H  -5.192174 -2.352873 -1.800328
H  1.850193 -1.934241 -2.183208
H  1.640468 -1.942595 -0.42508
H  3.197096 -1.455334 -1.136547
H  3.463314 2.800097 1.080261
H  4.671092 1.566826 1.48646
H  3.101372 1.568834 2.312768
elementType: S P O C H
totalener: -1676.49996369 hartree
nucrepener: 1316.61457004 hartree
electener: -2993.11453373 hartree
oneelecener: -4929.98366127 hartree
twoeener: 1936.86912754 hartree
cpcmener: -0.04848281 hartree
kineticenergy: 1671.88537527 hartree
xcener: -105.496822857069 hartree
chargesum: 0.0000000
charge: 0.474520 -0.199120 0.862787 -0.350074 -0.351587 -0.695034 -0.642233 -0.157786 -0.094117 -0.123906 -0.255832 -0.126138 -0.108520 0.112400 0.139363 0.128038 0.140171 0.111600 0.116724 0.087884 0.092723 0.098807 0.136017 0.105992 0.133623 0.121770 0.129938 0.111992
qa: 0.4745 -0.1991 0.8628 -0.3501 -0.3516 -0.6950 -0.6422 -0.1578 -0.0941 -0.1239 -0.2558 -0.1261 -0.1085 0.1124 0.1394 0.1280 0.1402 0.1116 0.1167 0.0879 0.0927 0.0988 0.1360 0.1060 0.1336 0.1218 0.1299 0.1120
va: 3.5339 2.2576 5.4782 2.0812 2.0956 1.6689 1.9647 3.8889 3.9012 3.9232 3.9258 3.8315 3.8435 1.0355 1.0094 1.0242 1.0067 1.0158 1.0109 1.0225 1.0022 1.0036 0.9854 1.0059 0.9957 0.9926 0.9903 0.9953
dispcorr: -0.012070738 hartree
energy: -1676.512034427515
dipole: -10.80381 9.34692 -1.45689 -4.14851 4.28724 0.13874 -1.14721 3.08529 1.93808
magnitude: 2.42857 au
magnitude: 6.17292 debye
