program: Orca
programVersion: 5.0.2
elementType: S S P O O O O C C C C C C H H H H H H H H H H H H H H H
charge: 0
multiplicity: 1
keywords: wb97x-d3
keywords: def2-TZVPP
keywords: def2/J RIJCOSX
keywords: DEFGRID2
keywords: scfconv7
keywords: smallprint printgap noloewdin
keywords: NOSOSCF
formula: C6H15O4PS2
InChI: InChI=1/C6H15O4PS2/c1-4-13(8)6-5-12-11(7,9-2)10-3/h4-6H2,1-3H3
28 atoms
S  -2.045924 0.406377 0.482306
S  1.099106 -0.833376 1.479541
P  1.373544 -0.004134 -0.406138
O  2.964427 0.020215 -0.541465
O  1.070087 1.540594 -0.204241
O  -3.206548 1.157261 1.111664
O  0.635526 -0.69504 -1.492877
C  -1.707291 -0.976884 1.60934
C  -0.460339 -1.765921 1.277464
C  -2.749791 -0.528215 -0.900858
C  -3.082901 0.416011 -2.038138
C  3.687274 -1.194185 -0.782052
C  0.659602 2.391633 -1.284782
H  -1.624407 -0.518984 2.596388
H  -2.579516 -1.634951 1.613117
H  -0.375589 -2.585412 1.991315
H  -0.48993 -2.218652 0.288436
H  -2.018697 -1.275019 -1.209433
H  -3.634754 -1.043029 -0.522171
H  -2.189949 0.913704 -2.418569
H  -3.527613 -0.143616 -2.860738
H  -3.799099 1.178195 -1.733254
H  3.373563 -1.662256 -1.714382
H  3.556509 -1.899414 0.039468
H  4.737282 -0.924723 -0.85339
H  -0.033988 3.120575 -0.87496
H  0.162139 1.837084 -2.078945
H  1.526788 2.905544 -1.695677
elementType: S P O C H
totalener: -1676.49830677 hartree
nucrepener: 1344.41088788 hartree
electener: -3020.90919465 hartree
oneelecener: -4984.52928819 hartree
twoeener: 1963.62009354 hartree
cpcmener: -0.04369241 hartree
kineticenergy: 1671.89604513 hartree
xcener: -105.498942483558 hartree
chargesum: 0.0000000
charge: 0.509894 -0.177359 0.850385 -0.364915 -0.346720 -0.719913 -0.631195 -0.127099 -0.134130 -0.152786 -0.252932 -0.108936 -0.117845 0.121716 0.124236 0.141938 0.132676 0.114557 0.118845 0.090728 0.101031 0.091763 0.120747 0.107372 0.129970 0.128263 0.110561 0.139146
qa: 0.5099 -0.1774 0.8504 -0.3649 -0.3467 -0.7199 -0.6312 -0.1271 -0.1341 -0.1528 -0.2529 -0.1089 -0.1178 0.1217 0.1242 0.1419 0.1327 0.1146 0.1188 0.0907 0.1010 0.0918 0.1207 0.1074 0.1300 0.1283 0.1106 0.1391
va: 3.5833 2.2715 5.4939 2.0981 2.0604 1.6535 1.9418 3.8922 3.9185 3.9143 3.9256 3.8474 3.8344 1.0208 1.0193 0.9998 1.0194 1.0170 1.0160 1.0033 1.0029 1.0189 0.9933 0.9971 0.9899 0.9836 0.9945 0.9949
dispcorr: -0.013210491 hartree
energy: -1676.511517261416
dipole: -6.85162 8.12007 1.26845 -3.37478 1.40579 -1.96900 -8.41718 7.76616 -0.65102
magnitude: 2.43099 au
magnitude: 6.17910 debye
