program: Gaussian 09
title: 000058712
version: EM64L-G09RevD.01
frameworkgroup: C1[X(C9H3N3S3)]
method: RPBEPBE
basis: SDD
operation: Freq
keyword: #pfreq=noraman
keyword: PBEPBE/SDD
title: #p freq=noraman PBEPBE/SDD
converged: YES YES NO NO
title: Mulliken charges:
elementType: S S S N N N C C C C C C C C C H H H
charge: 0.169905 0.169894 0.169932 0.303885 0.303899 0.303913 0.617957 0.617936 0.618008 -0.586971 -0.587004 -0.586825 -0.792279 -0.792322 -0.792510 0.287512 0.287541 0.287530
chargesum: 0.00000
title: Mulliken charges with hydrogens summed into heavy atoms:
elementType: S S S N N N C C C C C C C C C
charge: 0.169905 0.169894 0.169932 0.303885 0.303899 0.303913 0.617957 0.617936 0.618008 -0.299459 -0.299463 -0.299295 -0.792279 -0.792322 -0.792510
polarizability: 3.11951090e+02 3.26253501e-03 3.11569561e+02 1.13515414e-03 -1.29759339e-02 5.69569309e+01
1716.lowfreq: -4.4305 -0.6732 -0.0015 0.0006 0.0018 0.5707 10.2595 14.2900 32.6173
frequency: 9.4648 14.2661 32.5841 35.2608 75.6458 76.9793 247.9029 248.2646 249.6669 287.3563 287.7095 295.7124 387.3649 387.4156 397.6113 414.9204 415.7837 425.6205 426.7362 434.3906 559.3286 615.2790 615.5386 686.4332 711.7242 712.2991 869.2865 881.3639 882.5215 906.7441 977.0607 1042.3707 1042.7322 1204.8565 1205.5278 1271.0764 1368.7080 1369.2211 1432.9872 1433.4002 1582.6069 1582.9489 2184.2698 2184.5492 2207.4092 3182.6340 3183.3806 3186.2413
redmass: 22.1408 22.3052 10.8713 15.2259 9.1611 9.1058 4.8784 4.8574 11.9176 14.6429 14.6463 22.2177 8.5232 8.5070 11.8305 12.2633 12.3071 11.7099 11.7217 12.8475 4.8907 5.0343 5.0449 1.7710 13.0678 13.0696 14.9485 1.4382 1.4356 2.0624 6.2464 2.5239 2.5179 2.2524 2.2570 1.2470 12.1776 8.8132 4.3440 4.3573 5.9795 5.9961 12.8914 12.8909 12.8986 1.0935 1.0935 1.0949
irintensity: 0.1757 0.1780 0.0016 0.7874 0.0003 0.0006 0.0046 0.0022 0.1699 0.1173 0.1134 0.0001 5.2702 5.3507 0.0075 0.3909 0.3650 0.0041 0.0038 0.7758 0.0007 0.0011 0.0009 24.6334 137.2146 136.9070 0.0009 0.0127 0.0414 90.8425 0.0001 10.0349 10.0504 1.0065 1.0529 0.0007 0.0001 0.0008 7.7293 7.7652 391.4178 391.2436 2784.1048 2783.7121 0.2063 0.2679 0.2741 0.0051
temp: 298.150 k
press: 1.00000 atm
elementType: 16 16 16 7 7 7 6 6 6 6 6 6 6 6 6 1 1 1
symmnumber: 1
zpe: 264573.0 jmol-1
zpe.correction: 0.100771 hartree
zpe.thermalcorrener: 0.115128 hartree
zpe.thermalcorrenthalpy: 0.116072 hartree
zpe.thermalcorrgfe: 0.053169 hartree
zpe.sumelectzpe: -1702.191311 hartree
zpe.sumelectthermal: -1702.176953 hartree
zpe.sumelectthermalent: -1702.176009 hartree
zpe.sumelectthermalfe: -1702.238912 hartree
dipole: 0.0003 -0.0021 -0.0079
dipole: 0.0082
quadrupole: -122.4781 -122.4521 -108.0969
quadrupole: 0.0024 -0.0005 0.0020
quadrupole: -4.8024 -4.7764 9.5788 0.0024 -0.0005 0.0020
hfenergy: -1702.2920816 hartree
pointgroup: C01[X(C9H3N3S3)]
dipole: 0.0008185 0.0000484 -0.0031146 debye
dipolederiv: -1.5366047 -0.0222791 0.0038308 -0.0203754 -0.0352585 0.0000483 0.0073175 0.0001046 -0.0402512 -0.4273448 0.6580921 -0.0008157 0.6618531 -1.1449181 0.0013609 -0.0029623 0.0049493 -0.0402867 -0.3909918 -0.6388352 0.0001806 -0.638619 -1.1810635 0.0003356 -0.0018101 -0.0032341 -0.0402363 -3.2408985 -0.0451377 0.008804 -0.0464609 -0.1700697 0.0002405 0.0099293 0.0002569 -0.0287565 -0.9751531 1.3524473 -0.0018632 1.3508413 -2.4362193 0.0036556 -0.0025997 0.0049378 -0.028671 -0.8968513 -1.3055996 0.0002071 -1.3067068 -2.5140888 0.0000357 -0.0005979 -0.0014455 -0.0286288 2.1003068 0.0242931 -0.004399 0.0247295 0.4611577 -0.0003137 -0.0050272 -0.0003338 0.1397917 0.8908398 -0.7225363 0.0000253 -0.7214516 1.6699472 -0.0012142 0.0002268 -0.0017047 0.1395336 0.8484666 0.6977348 -0.0010692 0.6978204 1.7119984 -0.0011941 -0.0008185 -0.0006124 0.139522 -0.6880379 0.2302456 0.0005928 0.2296144 -0.4047687 -0.0000891 0.0008685 0.0000728 -0.1985828 -0.6738162 -0.2382143 0.0009417 -0.2375367 -0.4184768 0.0004309 0.0012316 0.000273 -0.1986412 -0.2758703 0.008145 -0.0001491 0.0077046 -0.815647 0.0004662 -0.000344 0.0004718 -0.1986917 3.456856 0.0515976 -0.0102232 0.0505897 -0.0480862 -0.0001567 -0.0141211 -0.0002155 -0.0592653 0.8691428 -1.5407203 0.0027561 -1.5429922 2.5405703 -0.0046771 0.0052252 -0.0088088 -0.0592024 0.7818423 1.4906588 0.0003977 1.4911167 2.6270581 0.0007425 0.0027401 0.004941 -0.059341 0.082512 -0.0482612 0.0002325 -0.0482851 0.0227809 0.000202 0.000204 0.0002376 0.1871373 0.0795532 0.050012 0.0001615 0.049894 0.0256935 0.0000576 0.0001349 0.0000338 0.1872154 -0.003951 -0.0016427 0.0003892 -0.001736 0.1093906 0.0000692 0.000403 0.0000763 0.1873548 unknown
polarizability: 311.5705114|0.0239898|311.949408|-0.3826176|-0.2003591|56.9576625 unknown
InChI: InChI=1S/C9H3N3S3/c13-4-10-7-1-8(11-5-14)3-9(2-7)12-6-15/h1-3H
charge 0 multiplicity 1
18 atoms
S  -5.622843 -0.083353 -0.106704
S  2.880183 -4.830576 -0.115687
S  2.737496 4.913061 -0.123116
N  -2.78997 -0.042387 -0.117519
N  1.431853 -2.395597 -0.123168
N  1.358565 2.438099 -0.126921
C  -1.412484 -0.021293 -0.120624
C  0.725731 -1.212671 -0.123537
C  0.688391 1.234416 -0.125479
C  -0.692855 -1.244116 -0.121024
C  -0.730508 1.222921 -0.122913
C  1.425256 0.021811 -0.125985
C  -3.99808 -0.06089 -0.114102
C  2.051149 -3.43307 -0.121365
C  1.946316 3.493758 -0.126601
H  -1.224744 -2.198622 -0.119529
H  -1.291071 2.160878 -0.122877
H  2.517815 0.03853 -0.128449
