program: Orca
programVersion: 5.0.2
elementType: S S P O O O O C C C C C C H H H H H H H H H H H H H H H
charge: 0
multiplicity: 1
keywords: wb97x-d3
keywords: def2-TZVPP
keywords: def2/J RIJCOSX
keywords: DEFGRID2
keywords: scfconv7
keywords: smallprint printgap noloewdin
keywords: NOSOSCF
formula: C6H15O4PS2
InChI: InChI=1/C6H15O4PS2/c1-4-13(8)6-5-12-11(7,9-2)10-3/h4-6H2,1-3H3
28 atoms
S  -2.070313 0.532933 0.628134
S  1.021653 -0.354134 1.36915
P  1.531751 -0.377329 -0.649117
O  3.02985 0.161369 -0.614422
O  0.757542 0.801725 -1.379765
O  -2.741763 0.594087 1.986607
O  1.283502 -1.669131 -1.326171
C  -1.524174 -1.186824 0.45126
C  -0.391403 -1.515398 1.399314
C  -3.381488 0.484205 -0.627966
C  -2.821461 0.554095 -2.036398
C  4.085907 -0.666714 -0.101164
C  0.821908 2.165953 -0.947706
H  -2.382082 -1.823509 0.681205
H  -1.24588 -1.365862 -0.586645
H  -0.730985 -1.486456 2.434792
H  -0.028967 -2.522822 1.204046
H  -3.988721 -0.407847 -0.462699
H  -3.998665 1.358268 -0.413342
H  -2.209045 1.443627 -2.184213
H  -2.22418 -0.319644 -2.295062
H  -3.646027 0.602267 -2.747116
H  4.06231 -1.661189 -0.546783
H  4.019473 -0.753187 0.983842
H  5.022123 -0.181524 -0.363583
H  0.639362 2.25658 0.123427
H  0.042834 2.701034 -1.483682
H  1.790373 2.600503 -1.191587
elementType: S P O C H
totalener: -1676.50103465 hartree
nucrepener: 1346.04064320 hartree
electener: -3022.54167785 hartree
oneelecener: -4987.46770330 hartree
twoeener: 1964.92602544 hartree
cpcmener: -0.04470967 hartree
kineticenergy: 1671.89416778 hartree
xcener: -105.501233238137 hartree
chargesum: 0.0000000
charge: 0.509599 -0.193966 0.861355 -0.354620 -0.345716 -0.717321 -0.638152 -0.198670 -0.099380 -0.092329 -0.294098 -0.111730 -0.130648 0.140174 0.121644 0.138237 0.133941 0.102909 0.112235 0.094937 0.099114 0.110288 0.121818 0.116333 0.130927 0.114834 0.128631 0.139657
qa: 0.5096 -0.1940 0.8614 -0.3546 -0.3457 -0.7173 -0.6382 -0.1987 -0.0994 -0.0923 -0.2941 -0.1117 -0.1306 0.1402 0.1216 0.1382 0.1339 0.1029 0.1122 0.0949 0.0991 0.1103 0.1218 0.1163 0.1309 0.1148 0.1286 0.1397
va: 3.5874 2.2580 5.4866 2.1038 2.0753 1.6588 1.9723 3.9346 3.8722 3.8704 3.9669 3.8455 3.8495 1.0162 1.0307 1.0178 1.0163 1.0189 1.0121 1.0021 1.0015 1.0021 0.9924 0.9917 0.9905 0.9903 0.9833 0.9980
dispcorr: -0.013521685 hartree
energy: -1676.514556338183
dipole: -6.28743 6.91836 0.63092 1.24001 -0.94576 0.29425 -5.56380 4.69835 -0.86545
magnitude: 1.11070 au
magnitude: 2.82317 debye
