program: Orca
programVersion: 5.0.2
elementType: S S P O O O O C C C C C C H H H H H H H H H H H H H H H
charge: 0
multiplicity: 1
keywords: wb97x-d3
keywords: def2-TZVPP
keywords: def2/J RIJCOSX
keywords: DEFGRID2
keywords: scfconv7
keywords: smallprint printgap noloewdin
keywords: NOSOSCF
formula: C6H15O4PS2
InChI: InChI=1/C6H15O4PS2/c1-4-13(8)6-5-12-11(7,9-2)10-3/h4-6H2,1-3H3
28 atoms
S  -3.083305 0.270584 0.379973
S  1.228182 -0.425644 1.272267
P  1.94742 0.103485 -0.610232
O  3.509893 -0.177634 -0.468158
O  1.904316 1.685629 -0.745413
O  -3.519734 -0.755332 1.408615
O  1.232794 -0.552327 -1.728432
C  -1.294986 0.547498 0.617385
C  -0.530258 -0.731057 0.882509
C  -3.027853 -0.594398 -1.215955
C  -4.439309 -0.833916 -1.716357
C  4.014838 -1.520511 -0.431481
C  2.516909 2.572483 0.198995
H  -0.950221 1.07248 -0.274877
H  -1.209622 1.233403 1.461514
H  -0.916539 -1.232955 1.769023
H  -0.579005 -1.434139 0.054564
H  -2.460028 0.033786 -1.904833
H  -2.492014 -1.534898 -1.077717
H  -5.018612 -1.43505 -1.015504
H  -4.969895 0.102733 -1.889288
H  -4.402685 -1.374721 -2.661504
H  3.630603 -2.109584 -1.263685
H  3.757683 -2.007692 0.508838
H  5.09598 -1.450805 -0.513519
H  2.245967 2.314627 1.223811
H  2.144615 3.569361 -0.020761
H  3.600857 2.56224 0.094207
elementType: S P O C H
totalener: -1676.50177215 hartree
nucrepener: 1278.55346874 hartree
electener: -2955.05524089 hartree
oneelecener: -4852.18929368 hartree
twoeener: 1897.13405278 hartree
cpcmener: -0.04332875 hartree
kineticenergy: 1671.86002402 hartree
xcener: -105.492279380285 hartree
chargesum: -0.0000000
charge: 0.474685 -0.193253 0.847454 -0.351507 -0.347750 -0.703474 -0.638632 -0.148514 -0.100006 -0.138010 -0.259190 -0.110349 -0.104938 0.123591 0.141159 0.129739 0.129594 0.117846 0.114154 0.089506 0.094838 0.098852 0.122127 0.114857 0.130332 0.109173 0.129472 0.128245
qa: 0.4747 -0.1933 0.8475 -0.3515 -0.3478 -0.7035 -0.6386 -0.1485 -0.1000 -0.1380 -0.2592 -0.1103 -0.1049 0.1236 0.1412 0.1297 0.1296 0.1178 0.1142 0.0895 0.0948 0.0989 0.1221 0.1149 0.1303 0.1092 0.1295 0.1282
va: 3.5245 2.2657 5.4877 2.0951 2.0816 1.6684 1.9693 3.8508 3.8650 3.9041 3.9358 3.8439 3.8303 1.0321 1.0104 1.0277 1.0251 1.0136 1.0120 1.0171 1.0042 1.0022 0.9926 0.9931 0.9906 0.9996 0.9889 0.9923
dispcorr: -0.011812684 hartree
energy: -1676.513584834540
dipole: -4.81919 6.77673 1.95753 -1.29755 2.28364 0.98609 -3.83731 3.70751 -0.12980
magnitude: 2.19571 au
magnitude: 5.58106 debye
