program: Orca
programVersion: 5.0.2
elementType: S S P O O O O C C C C C C H H H H H H H H H H H H H H H
charge: 0
multiplicity: 1
keywords: wb97x-d3
keywords: def2-TZVPP
keywords: def2/J RIJCOSX
keywords: DEFGRID2
keywords: scfconv7
keywords: smallprint printgap noloewdin
keywords: NOSOSCF
formula: C6H15O4PS2
InChI: InChI=1/C6H15O4PS2/c1-4-13(8)6-5-12-11(7,9-2)10-3/h4-6H2,1-3H3
28 atoms
S  -2.982374 -0.873466 0.740318
S  1.196904 0.438335 1.428656
P  1.529679 0.68582 -0.61542
O  1.767373 -0.737683 -1.278504
O  2.993096 1.313865 -0.640469
O  -3.410618 -2.299943 0.450378
O  0.446737 1.415459 -1.315144
C  -1.175723 -0.939628 0.968194
C  -0.628582 0.390729 1.448274
C  -3.041348 0.016782 -0.846921
C  -2.480079 -0.761032 -2.017251
C  2.740654 -1.673133 -0.797717
C  3.236459 2.640203 -0.146776
H  -1.013458 -1.714284 1.718774
H  -0.72324 -1.281338 0.037671
H  -0.991248 1.242405 0.875508
H  -0.900087 0.566444 2.48905
H  -4.099556 0.238205 -0.997822
H  -2.536654 0.973731 -0.702965
H  -2.636721 -0.186677 -2.930046
H  -1.410112 -0.942431 -1.929916
H  -2.985201 -1.717205 -2.141557
H  3.747703 -1.356163 -1.064028
H  2.524249 -2.62351 -1.277627
H  2.671012 -1.801838 0.283319
H  3.213144 2.657523 0.942543
H  2.507969 3.34994 -0.537485
H  4.228188 2.924165 -0.487228
elementType: S P O C H
totalener: -1676.50021726 hartree
nucrepener: 1304.81206089 hartree
electener: -2981.31227815 hartree
oneelecener: -4904.59152639 hartree
twoeener: 1923.27924825 hartree
cpcmener: -0.04476507 hartree
kineticenergy: 1671.86170096 hartree
xcener: -105.494073354586 hartree
chargesum: 0.0000000
charge: 0.477702 -0.192228 0.857756 -0.344123 -0.354827 -0.705402 -0.638043 -0.164060 -0.124575 -0.119782 -0.274082 -0.108050 -0.113596 0.143449 0.116486 0.131259 0.151159 0.128400 0.110032 0.109751 0.085090 0.089321 0.129195 0.129519 0.109721 0.116847 0.122731 0.130348
qa: 0.4777 -0.1922 0.8578 -0.3441 -0.3548 -0.7054 -0.6380 -0.1641 -0.1246 -0.1198 -0.2741 -0.1080 -0.1136 0.1434 0.1165 0.1313 0.1512 0.1284 0.1100 0.1098 0.0851 0.0893 0.1292 0.1295 0.1097 0.1168 0.1227 0.1303
va: 3.5330 2.2588 5.4714 2.0832 2.1070 1.6695 1.9676 3.8840 3.8843 3.8495 3.9431 3.8329 3.8508 1.0180 1.0226 1.0235 1.0028 1.0045 1.0239 1.0005 1.0063 1.0242 0.9927 0.9882 0.9993 0.9912 0.9911 0.9913
dispcorr: -0.013113307 hartree
energy: -1676.513330565497
dipole: -0.02089 2.48044 2.45955 -0.23054 1.66091 1.43037 -4.03636 5.04563 1.00927
magnitude: 3.01893 au
magnitude: 7.67352 debye
