program: Orca
programVersion: 5.0.2
elementType: S S P O O O O C C C C C C H H H H H H H H H H H H H H H
charge: 0
multiplicity: 1
keywords: wb97x-d3
keywords: def2-TZVPP
keywords: def2/J RIJCOSX
keywords: DEFGRID2
keywords: scfconv7
keywords: smallprint printgap noloewdin
keywords: NOSOSCF
formula: C6H15O4PS2
InChI: InChI=1/C6H15O4PS2/c1-4-13(8)6-5-12-11(7,9-2)10-3/h4-6H2,1-3H3
28 atoms
S  -3.277073 -0.432074 0.668441
S  1.041305 0.460731 1.255112
P  1.704005 0.59023 -0.712206
O  2.269125 -0.8335 -1.132349
O  3.025882 1.462567 -0.551496
O  -3.298516 -1.418509 1.822504
O  0.691612 1.061374 -1.685775
C  -1.685338 0.448631 0.764776
C  -0.513467 -0.475365 1.004685
C  -3.02386 -1.426524 -0.82658
C  -2.826637 -0.585772 -2.071206
C  3.291823 -1.519351 -0.399949
C  2.962032 2.875547 -0.304567
H  -1.581928 1.038946 -0.14525
H  -1.80462 1.146996 1.594988
H  -0.649559 -1.039941 1.925684
H  -0.369173 -1.196589 0.201806
H  -2.198668 -2.117677 -0.650515
H  -3.93829 -2.018999 -0.896387
H  -3.585863 0.191835 -2.16323
H  -1.845969 -0.113574 -2.097392
H  -2.906332 -1.223902 -2.950317
H  3.30034 -2.544537 -0.759372
H  3.083335 -1.522618 0.670604
H  4.265447 -1.066507 -0.580002
H  2.261423 3.36467 -0.97925
H  3.959102 3.268362 -0.479391
H  2.675406 3.076942 0.727022
elementType: S P O C H
totalener: -1676.50097956 hartree
nucrepener: 1288.35054505 hartree
electener: -2964.85152461 hartree
oneelecener: -4871.74265838 hartree
twoeener: 1906.89113377 hartree
cpcmener: -0.04300315 hartree
kineticenergy: 1671.86880169 hartree
xcener: -105.495591295378 hartree
chargesum: 0.0000000
charge: 0.477052 -0.194439 0.854179 -0.350172 -0.351797 -0.708675 -0.635450 -0.177479 -0.094512 -0.123585 -0.276743 -0.104114 -0.109308 0.128720 0.145061 0.133587 0.132179 0.106082 0.123074 0.095636 0.091099 0.105229 0.129198 0.110195 0.125654 0.121300 0.130551 0.117478
qa: 0.4771 -0.1944 0.8542 -0.3502 -0.3518 -0.7087 -0.6354 -0.1775 -0.0945 -0.1236 -0.2767 -0.1041 -0.1093 0.1287 0.1451 0.1336 0.1322 0.1061 0.1231 0.0956 0.0911 0.1052 0.1292 0.1102 0.1257 0.1213 0.1306 0.1175
va: 3.5377 2.2567 5.4894 2.0890 2.0930 1.6650 1.9686 3.8789 3.8510 3.8709 3.9483 3.8298 3.8450 1.0276 1.0114 1.0301 1.0173 1.0150 1.0090 1.0070 1.0119 1.0009 0.9898 0.9999 0.9915 0.9935 0.9899 0.9889
dispcorr: -0.012421043 hartree
energy: -1676.513400605661
dipole: -0.96643 2.90788 1.94145 -2.01467 2.49757 0.48290 -4.87828 4.45841 -0.41987
magnitude: 2.04419 au
magnitude: 5.19591 debye
