program: Orca
programVersion: 5.0.2
elementType: S S P O O O O C C C C C C H H H H H H H H H H H H H H H
charge: 0
multiplicity: 1
keywords: wb97x-d3
keywords: def2-TZVPP
keywords: def2/J RIJCOSX
keywords: DEFGRID2
keywords: scfconv7
keywords: smallprint printgap noloewdin
keywords: NOSOSCF
formula: C6H15O4PS2
InChI: InChI=1/C6H15O4PS2/c1-4-13(8)6-5-12-11(7,9-2)10-3/h4-6H2,1-3H3
28 atoms
S  -2.515238 0.312433 0.278615
S  0.698356 0.030697 1.170659
P  2.104727 0.016272 -0.348983
O  3.33706 -0.768062 0.285442
O  2.649617 1.515755 -0.334384
O  -3.103903 -0.249341 1.56037
O  1.616916 -0.492811 -1.654418
C  -1.420921 -0.985986 -0.369729
C  -0.374731 -1.360553 0.654439
C  -3.812356 0.211723 -0.994254
C  -4.69569 -1.010244 -0.865853
C  4.411314 -1.198356 -0.57059
C  1.886418 2.561647 -0.952401
H  -2.015423 -1.871363 -0.60401
H  -0.978639 -0.61008 -1.291861
H  -0.839567 -1.711693 1.575098
H  0.237279 -2.179842 0.281722
H  -4.39689 1.126114 -0.882308
H  -3.307013 0.265939 -1.960612
H  -5.473201 -0.966224 -1.627982
H  -4.149177 -1.940972 -1.01065
H  -5.18913 -1.04568 0.103223
H  5.169674 -1.626599 0.078645
H  4.845651 -0.362531 -1.119242
H  4.068884 -1.957859 -1.271702
H  2.42118 3.489426 -0.768721
H  0.888758 2.635806 -0.516818
H  1.80096 2.402976 -2.026675
elementType: S P O C H
totalener: -1676.49992060 hartree
nucrepener: 1286.54493252 hartree
electener: -2963.04485313 hartree
oneelecener: -4868.91602082 hartree
twoeener: 1905.87116770 hartree
cpcmener: -0.04350435 hartree
kineticenergy: 1671.88905806 hartree
xcener: -105.495330109498 hartree
chargesum: -0.0000000
charge: 0.477061 -0.176375 0.873556 -0.361259 -0.355771 -0.704508 -0.643906 -0.194477 -0.102895 -0.105987 -0.268376 -0.121153 -0.101043 0.143880 0.122269 0.135051 0.134720 0.122100 0.113930 0.105211 0.094944 0.083245 0.129652 0.124610 0.119270 0.130175 0.105113 0.120965
qa: 0.4771 -0.1764 0.8736 -0.3613 -0.3558 -0.7045 -0.6439 -0.1945 -0.1029 -0.1060 -0.2684 -0.1212 -0.1010 0.1439 0.1223 0.1351 0.1347 0.1221 0.1139 0.1052 0.0949 0.0832 0.1297 0.1246 0.1193 0.1302 0.1051 0.1210
va: 3.5120 2.2676 5.4554 2.0896 2.0853 1.6659 1.9360 3.9420 3.8621 3.8690 3.9435 3.8511 3.8414 1.0098 1.0382 1.0283 1.0192 1.0026 1.0154 1.0024 1.0002 1.0216 0.9891 0.9877 0.9934 0.9908 0.9971 0.9951
dispcorr: -0.011367336 hartree
energy: -1676.511287938423
dipole: -9.52664 10.07938 0.55274 -3.34819 3.45275 0.10456 -9.28988 7.18365 -2.10623
magnitude: 2.18006 au
magnitude: 5.54127 debye
