program: Orca
programVersion: 5.0.2
elementType: S S P O O O O C C C C C C H H H H H H H H H H H H H H H
charge: 0
multiplicity: 1
keywords: wb97x-d3
keywords: def2-TZVPP
keywords: def2/J RIJCOSX
keywords: DEFGRID2
keywords: scfconv7
keywords: smallprint printgap noloewdin
keywords: NOSOSCF
formula: C6H15O4PS2
InChI: InChI=1/C6H15O4PS2/c1-4-13(8)6-5-12-11(7,9-2)10-3/h4-6H2,1-3H3
28 atoms
S  -2.546745 0.362068 0.093497
S  0.461007 -0.679687 -0.730106
P  2.231204 0.362177 -0.479823
O  3.015973 -0.28519 0.746272
O  1.896107 1.745284 0.230763
O  -2.241413 1.601719 0.918009
O  2.924526 0.412874 -1.787649
C  -1.68212 -0.99839 0.936954
C  -0.19434 -0.724086 0.98145
C  -4.24445 -0.124232 0.510226
C  -4.674767 -1.396785 -0.1930
C  3.666241 -1.552286 0.588817
C  1.03182 2.695933 -0.405688
H  -2.068965 -1.071014 1.955995
H  -1.906919 -1.928305 0.412866
H  0.005736 0.219454 1.486445
H  0.301825 -1.520024 1.533765
H  -4.315061 -0.200873 1.59664
H  -4.853674 0.722517 0.188724
H  -5.740184 -1.553676 -0.02847
H  -4.515337 -1.340228 -1.26996
H  -4.154021 -2.27478 0.185792
H  2.946363 -2.337742 0.356586
H  4.141715 -1.776241 1.539578
H  4.424508 -1.512351 -0.19192
H  1.165931 3.638521 0.118042
H  -0.008511 2.385907 -0.319117
H  1.288119 2.834845 -1.455706
elementType: S P O C H
totalener: -1676.50193615 hartree
nucrepener: 1297.05860568 hartree
electener: -2973.56054184 hartree
oneelecener: -4889.65635300 hartree
twoeener: 1916.09581117 hartree
cpcmener: -0.04946586 hartree
kineticenergy: 1671.88615661 hartree
xcener: -105.497397207522 hartree
chargesum: -0.0000000
charge: 0.477142 -0.186249 0.839497 -0.346527 -0.341627 -0.699653 -0.640865 -0.180207 -0.111168 -0.091669 -0.282158 -0.108826 -0.106591 0.139891 0.131767 0.121821 0.137319 0.104612 0.118901 0.104365 0.095539 0.102160 0.112582 0.130892 0.125715 0.130355 0.097310 0.125673
qa: 0.4771 -0.1862 0.8395 -0.3465 -0.3416 -0.6997 -0.6409 -0.1802 -0.1112 -0.0917 -0.2822 -0.1088 -0.1066 0.1399 0.1318 0.1218 0.1373 0.1046 0.1189 0.1044 0.0955 0.1022 0.1126 0.1309 0.1257 0.1304 0.0973 0.1257
va: 3.5349 2.2756 5.5083 2.0848 2.0882 1.6696 1.9691 3.9627 3.9308 3.8824 3.9563 3.8326 3.8226 1.0093 1.0163 1.0318 1.0065 1.0210 1.0093 1.0005 1.0050 0.9988 0.9921 0.9901 0.9965 0.9924 1.0156 0.9951
dispcorr: -0.012065700 hartree
energy: -1676.514001852826
dipole: -14.59164 12.37284 -2.21881 -6.99628 4.35171 -2.64457 6.09166 -4.60083 1.49082
magnitude: 3.76024 au
magnitude: 9.55777 debye
