program: Orca
programVersion: 5.0.2
elementType: S S P O O O O C C C C C C H H H H H H H H H H H H H H H
charge: 0
multiplicity: 1
keywords: wb97x-d3
keywords: def2-TZVPP
keywords: def2/J RIJCOSX
keywords: DEFGRID2
keywords: scfconv7
keywords: smallprint printgap noloewdin
keywords: NOSOSCF
formula: C6H15O4PS2
InChI: InChI=1/C6H15O4PS2/c1-4-13(8)6-5-12-11(7,9-2)10-3/h4-6H2,1-3H3
28 atoms
S  -3.043064 -0.207193 -0.216957
S  0.953468 0.314608 1.567432
P  2.018608 0.493117 -0.202183
O  2.305512 -1.019448 -0.609235
O  3.459123 0.972634 0.288685
O  -3.752399 -0.251989 1.123302
O  1.362609 1.326897 -1.238505
C  -1.282597 -0.509784 0.133211
C  -0.741026 0.6292 0.970387
C  -3.369947 -1.787363 -1.045823
C  -4.839004 -1.901903 -1.39816
C  2.979743 -1.314569 -1.844774
C  3.667493 2.332682 0.692521
H  -1.202048 -1.465216 0.65437
H  -0.776389 -0.583071 -0.830459
H  -0.765277 1.579311 0.439207
H  -1.321602 0.74527 1.885837
H  -2.741719 -1.809026 -1.938249
H  -3.050037 -2.586859 -0.375105
H  -5.468505 -1.875248 -0.510083
H  -5.157886 -1.107524 -2.072735
H  -5.017002 -2.852745 -1.899123
H  2.942799 -2.392944 -1.968622
H  4.020213 -0.993864 -1.80791
H  2.482265 -0.842203 -2.69083
H  4.729381 2.441691 0.892459
H  3.109416 2.558726 1.601301
H  3.377668 3.029456 -0.092817
elementType: S P O C H
totalener: -1676.50197896 hartree
nucrepener: 1260.95031562 hartree
electener: -2937.45229458 hartree
oneelecener: -4817.29233502 hartree
twoeener: 1879.84004044 hartree
cpcmener: -0.04296075 hartree
kineticenergy: 1671.88714156 hartree
xcener: -105.493239181348 hartree
chargesum: 0.0000000
charge: 0.484389 -0.170626 0.859797 -0.355556 -0.361090 -0.704141 -0.642307 -0.176096 -0.090473 -0.129295 -0.256595 -0.114253 -0.104594 0.125105 0.125936 0.130625 0.135310 0.117589 0.113726 0.089294 0.093642 0.099087 0.129404 0.125658 0.116634 0.129998 0.108725 0.120107
qa: 0.4844 -0.1706 0.8598 -0.3556 -0.3611 -0.7041 -0.6423 -0.1761 -0.0905 -0.1293 -0.2566 -0.1143 -0.1046 0.1251 0.1259 0.1306 0.1353 0.1176 0.1137 0.0893 0.0936 0.0991 0.1294 0.1257 0.1166 0.1300 0.1087 0.1201
va: 3.5376 2.2822 5.4657 2.0720 2.0945 1.6690 1.9412 3.9134 3.8171 3.9078 3.9314 3.8404 3.8434 1.0217 1.0333 1.0273 1.0298 1.0146 1.0129 1.0193 1.0029 1.0027 0.9880 0.9910 0.9956 0.9900 0.9953 0.9945
dispcorr: -0.010878412 hartree
energy: -1676.512857371825
dipole: -6.31762 8.08580 1.76818 -6.11202 5.07545 -1.03656 -7.57556 6.20052 -1.37503
magnitude: 2.46812 au
magnitude: 6.27347 debye
