program: Orca
programVersion: 5.0.2
elementType: S S P O O O O C C C C C C H H H H H H H H H H H H H H H
charge: 0
multiplicity: 1
keywords: wb97x-d3
keywords: def2-TZVPP
keywords: def2/J RIJCOSX
keywords: DEFGRID2
keywords: scfconv7
keywords: smallprint printgap noloewdin
keywords: NOSOSCF
formula: C6H15O4PS2
InChI: InChI=1/C6H15O4PS2/c1-4-13(8)6-5-12-11(7,9-2)10-3/h4-6H2,1-3H3
28 atoms
S  -2.806809 0.668553 0.62941
S  1.227057 -0.817886 1.670282
P  2.107899 -0.093642 -0.054225
O  1.42114 1.323558 -0.271764
O  1.517667 -0.907588 -1.296503
O  -3.431523 -0.715586 0.607659
O  3.582068 -0.123275 0.089964
C  -1.214445 0.512397 1.500143
C  -0.547113 -0.822109 1.221374
C  -2.155098 0.979732 -1.040249
C  -3.283121 0.918908 -2.050015
C  1.641417 2.084693 -1.472246
C  1.885186 -2.277384 -1.500918
H  -0.614366 1.368725 1.194053
H  -1.424364 0.623003 2.564433
H  -0.987565 -1.605449 1.83503
H  -0.639863 -1.146162 0.18661
H  -1.699603 1.971416 -1.007084
H  -1.378784 0.249158 -1.273578
H  -4.066101 1.646326 -1.83445
H  -2.890283 1.139844 -3.041839
H  -3.732752 -0.071947 -2.088706
H  1.287074 3.091536 -1.270279
H  1.078954 1.665466 -2.30503
H  2.700127 2.125618 -1.727263
H  1.430431 -2.588307 -2.437209
H  1.507064 -2.906826 -0.694368
H  2.966477 -2.390918 -1.571902
elementType: S P O C H
totalener: -1676.50094233 hartree
nucrepener: 1313.50569515 hartree
electener: -2990.00663748 hartree
oneelecener: -4921.35536329 hartree
twoeener: 1931.34872581 hartree
cpcmener: -0.04793334 hartree
kineticenergy: 1671.86623457 hartree
xcener: -105.492994472053 hartree
chargesum: 0.0000000
charge: 0.472771 -0.168197 0.823894 -0.343649 -0.336494 -0.704533 -0.651844 -0.155615 -0.129024 -0.133775 -0.260571 -0.118956 -0.105932 0.126962 0.155645 0.143733 0.129678 0.116053 0.106900 0.095050 0.099773 0.089454 0.128228 0.122556 0.133051 0.129166 0.111686 0.123989
qa: 0.4728 -0.1682 0.8239 -0.3436 -0.3365 -0.7045 -0.6518 -0.1556 -0.1290 -0.1338 -0.2606 -0.1190 -0.1059 0.1270 0.1556 0.1437 0.1297 0.1161 0.1069 0.0950 0.0998 0.0895 0.1282 0.1226 0.1331 0.1292 0.1117 0.1240
va: 3.5151 2.2802 5.5003 2.0701 2.0536 1.6672 1.9668 3.8453 3.8720 3.8950 3.9489 3.8294 3.8336 1.0288 1.0026 1.0169 1.0197 1.0141 1.0156 1.0022 1.0026 1.0200 0.9879 0.9896 0.9955 0.9891 0.9930 0.9982
dispcorr: -0.013730605 hartree
energy: -1676.514672934369
dipole: -8.57500 8.17049 -0.40451 2.76209 -1.58257 1.17952 -12.90521 11.16731 -1.73790
magnitude: 2.13897 au
magnitude: 5.43683 debye
