program: Orca
programVersion: 5.0.2
elementType: S S P O O O O C C C C C C H H H H H H H H H H H H H H H
charge: 0
multiplicity: 1
keywords: wb97x-d3
keywords: def2-TZVPP
keywords: def2/J RIJCOSX
keywords: DEFGRID2
keywords: scfconv7
keywords: smallprint printgap noloewdin
keywords: NOSOSCF
formula: C6H15O4PS2
InChI: InChI=1/C6H15O4PS2/c1-4-13(8)6-5-12-11(7,9-2)10-3/h4-6H2,1-3H3
28 atoms
S  -3.180118 -0.177683 0.06362
S  0.930542 0.416459 1.546554
P  1.885612 0.563681 -0.287866
O  1.958156 -0.9480 -0.783094
O  3.400014 0.839759 0.129393
O  -3.778993 -0.164601 1.459178
O  1.282003 1.531523 -1.236339
C  -1.394653 -0.456201 0.287397
C  -0.806791 0.703679 1.063465
C  -3.595982 -1.789246 -0.655926
C  -3.046087 -1.961981 -2.058392
C  2.469943 -1.258431 -2.092141
C  3.817918 2.154538 0.523325
H  -1.262663 -1.402907 0.814501
H  -0.954485 -0.53324 -0.707326
H  -0.876825 1.642103 0.515978
H  -1.321417 0.83283 2.015721
H  -3.2463 -2.562406 0.030502
H  -4.687285 -1.807862 -0.660021
H  -3.470394 -2.862038 -2.501409
H  -3.310735 -1.124178 -2.70356
H  -1.963152 -2.073798 -2.067937
H  3.536878 -1.048537 -2.1519
H  1.942491 -0.701734 -2.865076
H  2.305473 -2.32117 -2.243475
H  4.902431 2.137529 0.569289
H  3.422198 2.406581 1.506731
H  3.502525 2.906848 -0.197735
elementType: S P O C H
totalener: -1676.50121498 hartree
nucrepener: 1271.89052819 hartree
electener: -2948.39174317 hartree
oneelecener: -4838.98023928 hartree
twoeener: 1890.58849611 hartree
cpcmener: -0.04423357 hartree
kineticenergy: 1671.87373475 hartree
xcener: -105.491256700663 hartree
chargesum: 0.0000000
charge: 0.485569 -0.169638 0.857870 -0.354335 -0.363464 -0.707225 -0.643112 -0.181758 -0.098843 -0.098805 -0.286123 -0.115001 -0.106131 0.129628 0.122009 0.133630 0.134582 0.105278 0.117571 0.104747 0.094959 0.101327 0.128848 0.118093 0.129788 0.130219 0.112283 0.118036
qa: 0.4856 -0.1696 0.8579 -0.3543 -0.3635 -0.7072 -0.6431 -0.1818 -0.0988 -0.0988 -0.2861 -0.1150 -0.1061 0.1296 0.1220 0.1336 0.1346 0.1053 0.1176 0.1047 0.0950 0.1013 0.1288 0.1181 0.1298 0.1302 0.1123 0.1180
va: 3.5489 2.2832 5.4741 2.0646 2.0955 1.6670 1.9416 3.9136 3.8307 3.8694 3.9642 3.8329 3.8451 1.0170 1.0289 1.0242 1.0308 1.0207 1.0102 0.9998 1.0050 0.9971 0.9911 0.9962 0.9881 0.9898 0.9929 0.9956
dispcorr: -0.011352976 hartree
energy: -1676.512567960018
dipole: -2.96010 4.60101 1.64091 -6.99564 5.67234 -1.32331 -9.24077 7.63356 -1.60721
magnitude: 2.65082 au
magnitude: 6.73785 debye
