program: Orca
programVersion: 5.0.2
elementType: S S P O O O O C C C C C C H H H H H H H H H H H H H H H
charge: 0
multiplicity: 1
keywords: wb97x-d3
keywords: def2-TZVPP
keywords: def2/J RIJCOSX
keywords: DEFGRID2
keywords: scfconv7
keywords: smallprint printgap noloewdin
keywords: NOSOSCF
formula: C6H15O4PS2
InChI: InChI=1/C6H15O4PS2/c1-4-13(8)6-5-12-11(7,9-2)10-3/h4-6H2,1-3H3
28 atoms
S  -2.02355 0.412174 0.436318
S  0.981707 -0.460364 1.465778
P  1.789067 -0.216369 -0.425656
O  3.155501 0.543629 -0.115316
O  0.908697 0.949164 -1.060704
O  -2.877329 0.234499 1.679419
O  1.88378 -1.459923 -1.229242
C  -1.350432 -1.23012 0.065212
C  -0.345433 -1.670449 1.108184
C  -3.151493 0.497168 -0.981807
C  -4.003212 1.747556 -0.893854
C  4.319736 -0.194021 0.286829
C  0.828601 1.11097 -2.486199
H  -2.18479 -1.935512 0.053042
H  -0.922641 -1.206809 -0.93752
H  -0.830544 -1.825087 2.071761
H  0.102905 -2.617015 0.812352
H  -2.521434 0.506688 -1.874062
H  -3.760528 -0.408535 -0.994507
H  -3.394815 2.65183 -0.891831
H  -4.666667 1.796559 -1.756418
H  -4.625374 1.748013 -0.000144
H  4.169276 -0.66498 1.258101
H  5.131486 0.523095 0.362058
H  4.579273 -0.953445 -0.448882
H  1.80171 1.352111 -2.911557
H  0.147527 1.938553 -2.663004
H  0.432983 0.216431 -2.963579
elementType: S P O C H
totalener: -1676.50039297 hartree
nucrepener: 1325.70652423 hartree
electener: -3002.20691719 hartree
oneelecener: -4946.97200806 hartree
twoeener: 1944.76509087 hartree
cpcmener: -0.04748601 hartree
kineticenergy: 1671.90023518 hartree
xcener: -105.497799490515 hartree
chargesum: -0.0000000
charge: 0.503633 -0.173002 0.867266 -0.366558 -0.348984 -0.715429 -0.644750 -0.180385 -0.111762 -0.132145 -0.255749 -0.107885 -0.129936 0.143663 0.115762 0.137114 0.136469 0.116535 0.112791 0.092354 0.098812 0.088377 0.112314 0.130420 0.119945 0.140638 0.130098 0.120395
qa: 0.5036 -0.1730 0.8673 -0.3666 -0.3490 -0.7154 -0.6448 -0.1804 -0.1118 -0.1321 -0.2557 -0.1079 -0.1299 0.1437 0.1158 0.1371 0.1365 0.1165 0.1128 0.0924 0.0988 0.0884 0.1123 0.1304 0.1199 0.1406 0.1301 0.1204
va: 3.5549 2.2805 5.4719 2.0995 2.0597 1.6547 1.9377 3.9276 3.8853 3.9099 3.9316 3.8445 3.8311 1.0149 1.0279 1.0179 1.0186 1.0125 1.0136 1.0031 1.0032 1.0199 0.9929 0.9897 0.9956 0.9904 0.9877 0.9928
dispcorr: -0.012522111 hartree
energy: -1676.512915077885
dipole: -8.73475 9.30362 0.56886 1.23527 -1.35582 -0.12055 -9.38092 7.19438 -2.18654
magnitude: 2.26254 au
magnitude: 5.75093 debye
