program: Orca
programVersion: 5.0.2
elementType: S S P O O O O C C C C C C H H H H H H H H H H H H H H H
charge: 0
multiplicity: 1
keywords: wb97x-d3
keywords: def2-TZVPP
keywords: def2/J RIJCOSX
keywords: DEFGRID2
keywords: scfconv7
keywords: smallprint printgap noloewdin
keywords: NOSOSCF
formula: C6H15O4PS2
InChI: InChI=1/C6H15O4PS2/c1-4-13(8)6-5-12-11(7,9-2)10-3/h4-6H2,1-3H3
28 atoms
S  -2.247763 0.413654 0.806816
S  0.929943 -0.433977 1.445517
P  1.652426 -0.1946 -0.480733
O  3.112119 0.407234 -0.255457
O  0.851907 1.079354 -1.00554
O  -3.074201 0.03746 2.023938
O  1.571262 -1.410496 -1.327053
C  -1.517705 -1.141866 0.223505
C  -0.425258 -1.628727 1.150469
C  -3.412521 0.653372 -0.565301
C  -2.725402 1.163904 -1.817063
C  4.209881 -0.460346 0.063033
C  0.951808 1.472468 -2.385913
H  -2.322204 -1.881269 0.194536
H  -1.155709 -1.005566 -0.795246
H  -0.821387 -1.835044 2.144859
H  -0.005089 -2.557624 0.769333
H  -3.948072 -0.282947 -0.731711
H  -4.125724 1.388491 -0.188272
H  -3.477591 1.381187 -2.574709
H  -2.175293 2.085094 -1.626474
H  -2.038037 0.4346 -2.243965
H  5.110097 0.145331 0.02011
H  4.293566 -1.275108 -0.654265
H  4.102331 -0.870097 1.06686
H  1.959195 1.813306 -2.621569
H  0.256464 2.294667 -2.525878
H  0.677863 0.655675 -3.051404
elementType: S P O C H
totalener: -1676.50091072 hartree
nucrepener: 1327.86086539 hartree
electener: -3004.36177611 hartree
oneelecener: -4951.16898771 hartree
twoeener: 1946.80721160 hartree
cpcmener: -0.04596455 hartree
kineticenergy: 1671.88730813 hartree
xcener: -105.495531150616 hartree
chargesum: 0.0000000
charge: 0.501802 -0.173421 0.865803 -0.364675 -0.345345 -0.713116 -0.644005 -0.190192 -0.107495 -0.091373 -0.297443 -0.108600 -0.137079 0.141551 0.113629 0.137452 0.135085 0.104738 0.111853 0.111181 0.096603 0.097729 0.130053 0.118814 0.112827 0.140775 0.128235 0.124615
qa: 0.5018 -0.1734 0.8658 -0.3647 -0.3453 -0.7131 -0.6440 -0.1902 -0.1075 -0.0914 -0.2974 -0.1086 -0.1371 0.1416 0.1136 0.1375 0.1351 0.1047 0.1119 0.1112 0.0966 0.0977 0.1301 0.1188 0.1128 0.1408 0.1282 0.1246
va: 3.5623 2.2774 5.4703 2.1001 2.0618 1.6593 1.9392 3.9252 3.8742 3.8660 3.9738 3.8466 3.8350 1.0170 1.0307 1.0202 1.0192 1.0188 1.0122 1.0012 1.0018 0.9961 0.9898 0.9960 0.9924 0.9938 0.9844 0.9924
dispcorr: -0.013220581 hartree
energy: -1676.514131303069
dipole: -5.35552 6.17788 0.82236 0.83246 -0.58842 0.24404 -11.42115 9.17630 -2.24485
magnitude: 2.40316 au
magnitude: 6.10835 debye
