program: Orca
programVersion: 5.0.2
elementType: S S P O O O O C C C C C C H H H H H H H H H H H H H H H
charge: 0
multiplicity: 1
keywords: wb97x-d3
keywords: def2-TZVPP
keywords: def2/J RIJCOSX
keywords: DEFGRID2
keywords: scfconv7
keywords: smallprint printgap noloewdin
keywords: NOSOSCF
formula: C6H15O4PS2
InChI: InChI=1/C6H15O4PS2/c1-4-13(8)6-5-12-11(7,9-2)10-3/h4-6H2,1-3H3
28 atoms
S  -3.115997 0.079924 0.489356
S  1.186227 -0.440757 1.468099
P  1.793475 0.288005 -0.376391
O  3.320423 -0.158805 -0.494516
O  1.940015 1.850354 -0.108774
O  -3.522462 -1.213926 1.174785
O  0.906492 -0.106491 -1.498866
C  -1.398857 0.432149 0.979974
C  -0.562327 -0.82381 1.099345
C  -2.830013 -0.338788 -1.253416
C  -4.158663 -0.618218 -1.926724
C  3.648693 -1.510687 -0.846218
C  2.391631 2.724005 -1.160545
H  -1.013627 1.13966 0.243323
H  -1.449398 0.951679 1.938064
H  -0.891681 -1.425091 1.945213
H  -0.595659 -1.453083 0.214045
H  -2.318916 0.508684 -1.711514
H  -2.173634 -1.208646 -1.295882
H  -4.803527 0.259882 -1.925397
H  -3.989442 -0.905275 -2.96429
H  -4.689847 -1.43745 -1.44397
H  4.73258 -1.573019 -0.870596
H  3.251107 -1.770693 -1.826134
H  3.268555 -2.210551 -0.102073
H  3.453877 2.57975 -1.352342
H  2.224229 3.73975 -0.813393
H  1.827998 2.5639 -2.079576
elementType: S P O C H
totalener: -1676.50047291 hartree
nucrepener: 1284.28877424 hartree
electener: -2960.78924715 hartree
oneelecener: -4863.99812262 hartree
twoeener: 1903.20887547 hartree
cpcmener: -0.04045163 hartree
kineticenergy: 1671.87952391 hartree
xcener: -105.493146242525 hartree
chargesum: 0.0000000
charge: 0.472713 -0.172887 0.863312 -0.360126 -0.356596 -0.703826 -0.640635 -0.152547 -0.106562 -0.135927 -0.261104 -0.105124 -0.116229 0.120992 0.145132 0.132545 0.131978 0.115129 0.113266 0.094897 0.099024 0.089176 0.130137 0.121405 0.108831 0.125404 0.129872 0.117747
qa: 0.4727 -0.1729 0.8633 -0.3601 -0.3566 -0.7038 -0.6406 -0.1525 -0.1066 -0.1359 -0.2611 -0.1051 -0.1162 0.1210 0.1451 0.1325 0.1320 0.1151 0.1133 0.0949 0.0990 0.0892 0.1301 0.1214 0.1088 0.1254 0.1299 0.1177
va: 3.5193 2.2823 5.4539 2.0945 2.0807 1.6676 1.9385 3.8528 3.8645 3.9006 3.9398 3.8426 3.8427 1.0303 1.0094 1.0228 1.0244 1.0178 1.0140 1.0038 1.0020 1.0189 0.9899 0.9953 0.9953 0.9922 0.9878 0.9943
dispcorr: -0.011970993 hartree
energy: -1676.512443899826
dipole: -4.36411 6.35071 1.98660 -0.54313 1.74576 1.20262 -10.32723 9.06049 -1.26674
magnitude: 2.64528 au
magnitude: 6.72377 debye
