program: Orca
programVersion: 5.0.2
elementType: S S P O O O O C C C C C C H H H H H H H H H H H H H H H
charge: 0
multiplicity: 1
keywords: wb97x-d3
keywords: def2-TZVPP
keywords: def2/J RIJCOSX
keywords: DEFGRID2
keywords: scfconv7
keywords: smallprint printgap noloewdin
keywords: NOSOSCF
formula: C6H15O4PS2
InChI: InChI=1/C6H15O4PS2/c1-4-13(8)6-5-12-11(7,9-2)10-3/h4-6H2,1-3H3
28 atoms
S  -2.955294 -0.532358 -0.989392
S  0.970373 -0.576272 1.103121
P  2.043598 0.44216 -0.358398
O  3.534612 0.005475 -0.01081
O  2.032883 1.986764 0.01068
O  -3.000783 0.985198 -0.949257
O  1.575819 0.233845 -1.748184
C  -1.28263 -1.026089 -0.453685
C  -0.74146 -0.127065 0.636661
C  -3.894386 -1.127764 0.446518
C  -5.328617 -0.645302 0.359902
C  4.005596 -1.324201 -0.279016
C  2.495457 2.494463 1.268424
H  -1.341254 -2.069439 -0.139477
H  -0.660962 -0.978447 -1.347045
H  -0.770463 0.922317 0.349649
H  -1.30529 -0.226957 1.563047
H  -3.835753 -2.217371 0.41269
H  -3.417568 -0.784019 1.36537
H  -5.898298 -1.0594 1.191114
H  -5.390824 0.439617 0.42642
H  -5.813131 -0.963918 -0.563636
H  3.645662 -2.021485 0.477274
H  5.090672 -1.287187 -0.239281
H  3.695813 -1.665793 -1.265966
H  2.137082 3.517395 1.343994
H  3.583618 2.490362 1.309667
H  2.096614 1.918156 2.104426
elementType: S P O C H
totalener: -1676.50044343 hartree
nucrepener: 1269.48481318 hartree
electener: -2945.98525661 hartree
oneelecener: -4834.64585701 hartree
twoeener: 1888.66060040 hartree
cpcmener: -0.05015268 hartree
kineticenergy: 1671.86639104 hartree
xcener: -105.493949725793 hartree
chargesum: 0.0000000
charge: 0.472520 -0.195386 0.845131 -0.350211 -0.349278 -0.701975 -0.636607 -0.165643 -0.099402 -0.134445 -0.261833 -0.107810 -0.103337 0.132379 0.139087 0.118603 0.148544 0.116155 0.117341 0.099390 0.090187 0.093798 0.117812 0.130117 0.120544 0.129155 0.124802 0.110363
qa: 0.4725 -0.1954 0.8451 -0.3502 -0.3493 -0.7020 -0.6366 -0.1656 -0.0994 -0.1344 -0.2618 -0.1078 -0.1033 0.1324 0.1391 0.1186 0.1485 0.1162 0.1173 0.0994 0.0902 0.0938 0.1178 0.1301 0.1205 0.1292 0.1248 0.1104
va: 3.5164 2.2597 5.5075 2.0884 2.0878 1.6718 1.9700 3.8856 3.8578 3.8985 3.9415 3.8450 3.8296 1.0169 1.0268 1.0467 0.9991 1.0160 1.0092 1.0026 1.0190 1.0026 0.9882 0.9905 0.9932 0.9901 0.9914 0.9998
dispcorr: -0.011338610 hartree
energy: -1676.511782042945
dipole: -9.42193 9.98877 0.56684 -4.29183 1.99762 -2.29421 7.89301 -4.87607 3.01694
magnitude: 3.83231 au
magnitude: 9.74097 debye
