program: Orca
programVersion: 5.0.2
elementType: S S P O O O O C C C C C C H H H H H H H H H H H H H H H
charge: 0
multiplicity: 1
keywords: wb97x-d3
keywords: def2-TZVPP
keywords: def2/J RIJCOSX
keywords: DEFGRID2
keywords: scfconv7
keywords: smallprint printgap noloewdin
keywords: NOSOSCF
formula: C6H15O4PS2
InChI: InChI=1/C6H15O4PS2/c1-4-13(8)6-5-12-11(7,9-2)10-3/h4-6H2,1-3H3
28 atoms
S  -2.965793 -0.544413 -0.98479
S  0.967801 -0.564311 1.093594
P  2.054649 0.455367 -0.356041
O  3.538779 -0.019344 -0.029448
O  2.083618 1.993172 0.038613
O  -3.034297 0.971763 -0.934539
O  1.567025 0.284771 -1.743875
C  -1.280811 -1.01594 -0.466825
C  -0.739907 -0.108767 0.616819
C  -3.881777 -1.162934 0.456177
C  -5.325429 -0.707774 0.380734
C  3.979737 -1.355235 -0.313849
C  2.555303 2.472038 1.303494
H  -1.323292 -2.059358 -0.150658
H  -0.66848 -0.961011 -1.365999
H  -0.762911 0.938049 0.320355
H  -1.307819 -0.1966 1.542092
H  -3.802662 -2.251033 0.418859
H  -3.404019 -0.812554 1.371776
H  -5.40663 0.375887 0.445027
H  -5.810945 -1.037499 -0.538131
H  -5.881134 -1.129908 1.21711
H  5.065143 -1.343063 -0.269943
H  3.665919 -1.676104 -1.306356
H  3.60176 -2.054114 0.431881
H  3.642669 2.438081 1.34833
H  2.137434 1.896988 2.130771
H  2.224558 3.503335 1.390716
elementType: S P O C H
totalener: -1676.50051999 hartree
nucrepener: 1268.43318374 hartree
electener: -2944.93370374 hartree
oneelecener: -4832.52367750 hartree
twoeener: 1887.58997376 hartree
cpcmener: -0.05013864 hartree
kineticenergy: 1671.87115318 hartree
xcener: -105.494952415014 hartree
chargesum: -0.0000000
charge: 0.472379 -0.195675 0.846146 -0.349756 -0.349270 -0.701888 -0.637154 -0.164282 -0.099860 -0.134438 -0.261365 -0.107779 -0.102583 0.131814 0.139057 0.118156 0.148770 0.115906 0.117285 0.090038 0.093812 0.099216 0.130051 0.120857 0.117376 0.124420 0.109781 0.128987
qa: 0.4724 -0.1957 0.8461 -0.3498 -0.3493 -0.7019 -0.6372 -0.1643 -0.0999 -0.1344 -0.2614 -0.1078 -0.1026 0.1318 0.1391 0.1182 0.1488 0.1159 0.1173 0.0900 0.0938 0.0992 0.1301 0.1209 0.1174 0.1244 0.1098 0.1290
va: 3.5161 2.2598 5.5073 2.0890 2.0890 1.6719 1.9692 3.8843 3.8590 3.8992 3.9404 3.8456 3.8306 1.0168 1.0270 1.0459 0.9997 1.0162 1.0093 1.0192 1.0026 1.0027 0.9906 0.9929 0.9885 0.9913 0.9998 0.9900
dispcorr: -0.011312447 hartree
energy: -1676.511832440804
dipole: -9.33620 9.95497 0.61876 -4.60100 2.24115 -2.35984 7.87107 -4.88302 2.98805
magnitude: 3.85749 au
magnitude: 9.80495 debye
