program: Orca
programVersion: 5.0.2
elementType: S S P O O O O C C C C C C H H H H H H H H H H H H H H H
charge: 0
multiplicity: 1
keywords: wb97x-d3
keywords: def2-TZVPP
keywords: def2/J RIJCOSX
keywords: DEFGRID2
keywords: scfconv7
keywords: smallprint printgap noloewdin
keywords: NOSOSCF
formula: C6H15O4PS2
InChI: InChI=1/C6H15O4PS2/c1-4-13(8)6-5-12-11(7,9-2)10-3/h4-6H2,1-3H3
28 atoms
S  -3.042787 -1.079204 0.841947
S  0.884896 0.893015 1.496712
P  1.664962 0.669497 -0.409268
O  2.057704 -0.872482 -0.475005
O  3.095797 1.364289 -0.294567
O  -3.185858 -2.554877 0.516987
O  0.781128 1.161166 -1.494977
C  -1.245488 -0.793149 0.926741
C  -0.896175 0.661804 1.154273
C  -3.437331 -0.17173 -0.681974
C  -2.663222 -0.627056 -1.899576
C  2.549264 -1.4361 -1.704576
C  3.216792 2.792518 -0.365565
H  -0.914299 -1.406507 1.766323
H  -0.802116 -1.199361 0.017084
H  -1.170532 1.299426 0.316316
H  -1.393226 1.053938 2.042501
H  -4.509604 -0.331816 -0.81096
H  -3.299103 0.890251 -0.469115
H  -2.696802 -1.710385 -2.012509
H  -3.110682 -0.191438 -2.792994
H  -1.621648 -0.309883 -1.869126
H  3.525869 -1.02575 -1.957669
H  1.854357 -1.261052 -2.524986
H  2.643372 -2.505281 -1.53833
H  2.791832 3.262952 0.521192
H  2.729856 3.189069 -1.255156
H  4.278969 3.014628 -0.41125
elementType: S P O C H
totalener: -1676.50072658 hartree
nucrepener: 1291.05682037 hartree
electener: -2967.55754695 hartree
oneelecener: -4877.20242033 hartree
twoeener: 1909.64487338 hartree
cpcmener: -0.04393992 hartree
kineticenergy: 1671.87004213 hartree
xcener: -105.492293037601 hartree
chargesum: -0.0000000
charge: 0.478832 -0.171782 0.863325 -0.353766 -0.364096 -0.707773 -0.637090 -0.162765 -0.124704 -0.133716 -0.259573 -0.115650 -0.106032 0.141500 0.114783 0.135058 0.146369 0.127727 0.116224 0.088113 0.108113 0.079219 0.128432 0.117857 0.130311 0.111116 0.119436 0.130531
qa: 0.4788 -0.1718 0.8633 -0.3538 -0.3641 -0.7078 -0.6371 -0.1628 -0.1247 -0.1337 -0.2596 -0.1156 -0.1060 0.1415 0.1148 0.1351 0.1464 0.1277 0.1162 0.0881 0.1081 0.0792 0.1284 0.1179 0.1303 0.1111 0.1194 0.1305
va: 3.5389 2.2829 5.4647 2.0697 2.0998 1.6655 1.9451 3.8827 3.8818 3.8613 3.9141 3.8354 3.8439 1.0179 1.0276 1.0266 1.0054 1.0064 1.0166 1.0266 1.0027 1.0141 0.9914 0.9948 0.9884 0.9936 0.9958 0.9899
dispcorr: -0.012613383 hartree
energy: -1676.513339963522
dipole: -2.70155 4.00992 1.30836 1.54998 0.62188 2.17186 -9.62099 9.38431 -0.23668
magnitude: 2.54653 au
magnitude: 6.47277 debye
