program: Orca
programVersion: 5.0.2
elementType: S S P O O O O C C C C C C H H H H H H H H H H H H H H H
charge: 0
multiplicity: 1
keywords: wb97x-d3
keywords: def2-TZVPP
keywords: def2/J RIJCOSX
keywords: DEFGRID2
keywords: scfconv7
keywords: smallprint printgap noloewdin
keywords: NOSOSCF
formula: C6H15O4PS2
InChI: InChI=1/C6H15O4PS2/c1-4-13(8)6-5-12-11(7,9-2)10-3/h4-6H2,1-3H3
28 atoms
S  -3.068915 -0.691614 0.585203
S  1.059246 0.468585 1.65747
P  1.587174 0.553297 -0.348757
O  1.756463 -0.975984 -0.761444
O  3.103618 1.041519 -0.282691
O  -3.581101 -2.11348 0.438306
O  0.680902 1.358806 -1.204663
C  -1.346744 -0.84471 1.161184
C  -0.761395 0.510378 1.517879
C  -2.754443 -0.079004 -1.099801
C  -2.078642 -1.082732 -2.008496
C  1.959806 -1.324566 -2.143801
C  3.414067 2.429914 -0.096398
H  -1.395132 -1.486856 2.04149
H  -0.776878 -1.374724 0.399113
H  -1.023543 1.297573 0.813099
H  -1.110778 0.835096 2.497345
H  -3.740395 0.190928 -1.482379
H  -2.18655 0.848185 -1.009281
H  -2.655955 -2.002006 -2.087592
H  -1.998985 -0.656973 -3.008295
H  -1.070599 -1.335598 -1.683634
H  1.181891 -0.902744 -2.778904
H  1.915267 -2.408291 -2.198939
H  2.936334 -0.986572 -2.489395
H  3.159343 2.752797 0.913445
H  2.892189 3.055356 -0.819665
H  4.485489 2.533895 -0.243696
elementType: S P O C H
totalener: -1676.49916817 hartree
nucrepener: 1308.32414376 hartree
electener: -2984.82331193 hartree
oneelecener: -4911.56722950 hartree
twoeener: 1926.74391757 hartree
cpcmener: -0.04274866 hartree
kineticenergy: 1671.85943742 hartree
xcener: -105.490657096992 hartree
chargesum: 0.0000000
charge: 0.476705 -0.170332 0.866122 -0.355450 -0.365667 -0.705573 -0.638401 -0.163759 -0.141809 -0.123963 -0.273036 -0.118476 -0.106743 0.148809 0.118807 0.131313 0.153774 0.130542 0.109832 0.094125 0.112250 0.077055 0.114453 0.133191 0.135774 0.111398 0.119009 0.130052
qa: 0.4767 -0.1703 0.8661 -0.3555 -0.3657 -0.7056 -0.6384 -0.1638 -0.1418 -0.1240 -0.2730 -0.1185 -0.1067 0.1488 0.1188 0.1313 0.1538 0.1305 0.1098 0.0941 0.1123 0.0771 0.1145 0.1332 0.1358 0.1114 0.1190 0.1301
va: 3.5295 2.2788 5.4646 2.0664 2.1026 1.6686 1.9434 3.8611 3.8939 3.8402 3.9481 3.8244 3.8465 1.0158 1.0226 1.0241 1.0012 1.0048 1.0287 1.0255 1.0001 0.9927 0.9925 0.9869 0.9929 0.9933 0.9956 0.9899
dispcorr: -0.013651588 hartree
energy: -1676.512819762011
dipole: -0.64354 2.65692 2.01338 0.12699 1.47112 1.59812 -9.63170 9.27706 -0.35464
magnitude: 2.59489 au
magnitude: 6.59568 debye
