program: Gaussian 09
title: 000006201
version: EM64L-G09RevD.01
frameworkgroup: C1[X(C11H8O)]
method: RPBEPBE
basis: SDD
operation: Freq
keyword: #pfreq=noraman
keyword: PBEPBE/SDD
title: #p freq=noraman PBEPBE/SDD
converged: NO YES NO YES
title: Mulliken charges:
elementType: O C C C C C C C C C C C H H H H H H H H
charge: -0.207940 0.378025 0.388519 -0.564214 -0.400890 0.403399 -0.403417 -0.402898 -0.385763 -0.238513 -0.231752 -0.211483 0.243094 0.242314 0.241788 0.243531 0.273098 0.233744 0.233011 0.166348
chargesum: 0.00000
title: Mulliken charges with hydrogens summed into heavy atoms:
elementType: O C C C C C C C C C C C
charge: -0.207940 0.378025 0.388519 -0.321120 -0.158576 0.403399 -0.161629 -0.159367 -0.112666 -0.004769 0.001259 -0.045135
polarizability: 2.13800525e+02 4.68516586e+00 1.22054313e+02 -1.77958823e-03 2.51054715e-03 4.58781178e+01
1716.lowfreq: -12.6311 0.0001 0.0004 0.0006 5.9676 9.9326 82.3603 162.6988 170.7260
frequency: 82.3593 162.6968 170.7220 195.5960 299.4367 339.2209 383.1292 393.3631 480.0177 509.0799 510.0882 599.6339 626.3891 644.6747 748.7964 759.3346 763.9786 790.2683 845.1760 875.6900 877.5040 920.7611 949.8658 966.8707 989.3293 996.1091 1006.5130 1023.7594 1121.1819 1152.2207 1174.6008 1182.7648 1237.3075 1269.7214 1275.3498 1341.9399 1380.0574 1413.7619 1431.6196 1435.4488 1463.0144 1512.7076 1577.4455 1602.5136 1612.1180 1637.5855 2864.5960 3110.4408 3124.1142 3128.4965 3130.0686 3146.3037 3160.4196 3165.1251
redmass: 7.4118 3.1416 6.6411 4.2956 2.8283 6.6360 4.8924 3.0604 2.5039 6.8553 3.2538 7.0308 6.7275 3.0222 4.5658 1.2418 5.5827 2.6153 1.2956 5.0311 1.4204 1.7185 4.0718 1.3958 1.6448 1.3559 1.4716 2.2860 1.7507 1.2171 1.1004 1.4602 2.0206 2.1007 1.8292 1.8207 1.3549 6.3611 3.2095 2.9057 2.5398 3.8115 7.4290 5.7500 6.6376 6.8258 1.0849 1.0910 1.0860 1.0893 1.0883 1.0950 1.0964 1.1004
irintensity: 1.7770 4.6289 6.7422 8.1202 5.0953 3.3132 5.2502 0.0001 24.2939 0.0434 0.0569 7.6656 1.5090 1.1898 20.6758 48.1081 15.5845 0.0033 42.8807 4.3789 40.6318 2.5378 0.6879 2.1598 16.9583 0.4324 2.1970 3.8808 26.8437 2.2482 2.9394 62.3815 1.7619 17.9997 16.4616 12.7868 8.4952 12.4885 6.3352 7.0274 17.1002 5.1049 47.0822 1.7830 310.6030 6.4891 123.1767 8.9105 3.4624 3.4786 3.4763 28.0105 8.1127 31.0101
temp: 298.150 k
press: 1.00000 atm
elementType: 8 6 6 6 6 6 6 6 6 6 6 6 1 1 1 1 1 1 1 1
symmnumber: 1
zpe: 404106.2 jmol-1
zpe.correction: 0.153916 hartree
zpe.thermalcorrener: 0.162870 hartree
zpe.thermalcorrenthalpy: 0.163814 hartree
zpe.thermalcorrgfe: 0.119664 hartree
zpe.sumelectzpe: -498.382920 hartree
zpe.sumelectthermal: -498.373966 hartree
zpe.sumelectthermalent: -498.373022 hartree
zpe.sumelectthermalfe: -498.417172 hartree
dipole: -4.4737 -0.8525 -0.0005
dipole: 4.5542
quadrupole: -80.1009 -57.3790 -73.8547
quadrupole: -3.0065 -0.0032 0.0000
quadrupole: -9.6560 13.0658 -3.4098 -3.0065 -0.0032 0.0000
hfenergy: -498.536836 hartree
pointgroup: C01 [X(C11H8O1)]
dipole: 1.7622989 -0.3236791 0.0002052 debye
dipolederiv: -1.3489525 0.0095935 0.0000929 0.3543138 -0.4404221 -0.0000656 -0.0003574 0.0000623 -0.3359935 -0.0964467 -0.1294312 0.0000155 -0.1442185 -0.1432375 0.0000182 -0.0000147 0.0000201 0.0466688 0.2717744 -0.0920336 -0.0000083 0.0322228 -0.0812696 0.0000022 -0.0000049 0.0000065 0.0467183 0.3649266 0.1250311 -0.0000442 -0.0898232 0.0638907 -0.0000008 0.0001387 0.0000008 -0.168154 -0.2245812 0.1004827 0.0000058 -0.0072323 0.1602106 -0.0000114 0.0000138 -0.000021 -0.1611179 -0.9880424 -0.0804202 -0.0000064 -0.2743834 -0.075359 -0.0000287 0.0000089 0.0000085 0.0233514 -0.0071013 0.0970247 -0.0000108 -0.0685975 0.115119 -0.0000119 -0.0000267 -0.000027 -0.1632296 -0.231615 0.0796178 0.0000016 0.1220905 0.115853 -0.0000132 0.0000009 -0.0000051 -0.1697168 0.0350022 -0.1419762 -0.0000308 0.1566523 0.0086058 0.0000054 0.0000526 0.0000187 -0.1314038 -0.0010544 -0.162382 -0.0000053 -0.1273147 -0.0055251 0.0000002 0.0000015 0.0000032 -0.1593388 0.1031981 0.0880242 -0.0000158 0.0203887 0.0568953 -0.000008 -0.0000121 -0.0000133 -0.1435717 1.9401108 0.0701098 -0.0000269 0.2003752 0.7384358 0.0001321 0.0002751 0.0000871 0.1035908 0.0692443 -0.0217017 0.0000016 -0.0484497 -0.0800148 0.0000066 0.0000129 0.0000013 0.1541222 0.0603754 -0.069214 0.0000005 -0.0142665 -0.0936458 0.0000033 -0.0000181 0.0000089 0.1529763 0.0727683 -0.0669775 0.0000067 0.0041364 -0.0915934 0.0000086 0.0000015 0.0000111 0.1575213 0.0698739 0.0094197 0.0000034 -0.0635509 -0.0980262 0.0000096 0.0000069 0.0000057 0.1580648 0.040244 0.0933173 0.0000108 0.03259 0.0540575 -0.000005 0.000009 0.0000013 0.160037 -0.0525426 0.103385 0.0000062 0.1116302 0.0075523 -0.0000004 0.0000082 0.0000037 0.1630275 -0.1066964 -0.0696512 0.0000137 -0.0715488 0.0671696 0.0000067 0.0000134 0.0000055 0.1598981 0.0295145 0.0577818 -0.0000101 -0.1250142 -0.278696 -0.0000481 -0.0001093 -0.0001783 0.1065495 unknown
polarizability: 213.8589028|-4.0732527|121.9959345|-0.0017628|-0.0025224|45.8781178 unknown
InChI: InChI=1S/C11H8O/c12-8-9-5-6-10-3-1-2-4-11(10)7-9/h1-8H
charge 0 multiplicity 1
20 atoms
O  -4.236442 -0.052567 -0.000366
C  0.622209 -0.634846 -0.000009
C  0.854491 0.7984 -0.000057
C  -0.725563 -1.113472 0.000057
C  -0.275018 1.689363 -0.000029
C  -1.809424 -0.221737 0.000097
C  1.747656 -1.524744 -0.000039
C  2.203029 1.280018 -0.000141
C  -1.575398 1.197464 0.000036
C  3.05157 -1.024349 -0.000109
C  3.280168 0.388703 -0.000158
C  -3.191382 -0.758387 0.000227
H  -0.910061 -2.196517 0.000094
H  -0.091919 2.770452 -0.000055
H  1.569009 -2.606697 0.000003
H  2.379895 2.362047 -0.000182
H  -2.445969 1.86178 0.000073
H  3.905461 -1.710233 -0.00013
H  4.307503 0.769103 -0.000216
H  -3.257517 -1.877081 -0.000296
