program: Orca
programVersion: 5.0.2
elementType: S S P O O O O C C C C C C H H H H H H H H H H H H H H H
charge: 0
multiplicity: 1
keywords: wb97x-d3
keywords: def2-TZVPP
keywords: def2/J RIJCOSX
keywords: DEFGRID2
keywords: scfconv7
keywords: smallprint printgap noloewdin
keywords: NOSOSCF
formula: C6H15O4PS2
InChI: InChI=1/C6H15O4PS2/c1-4-13(8)6-5-12-11(7,9-2)10-3/h4-6H2,1-3H3
28 atoms
S  -3.164041 0.139318 0.219512
S  1.114189 -0.280104 1.212636
P  1.943936 0.364934 -0.583233
O  3.372734 -0.337776 -0.54862
O  2.305652 1.904191 -0.434071
O  -3.670684 0.236974 1.647299
O  1.096167 0.139876 -1.776653
C  -1.496962 -0.584319 0.32364
C  -0.585659 0.379715 1.053495
C  -4.006927 -1.282063 -0.529835
C  -3.629993 -1.479151 -1.984755
C  3.508402 -1.748134 -0.784647
C  3.16057 2.414725 0.595642
H  -1.574211 -1.538954 0.847963
H  -1.151202 -0.760638 -0.694806
H  -0.550394 1.358268 0.574353
H  -0.918877 0.529602 2.07944
H  -3.79548 -2.16174 0.081389
H  -5.068833 -1.048509 -0.430989
H  -3.795432 -0.575165 -2.570121
H  -2.591569 -1.782124 -2.10681
H  -4.250222 -2.265663 -2.412638
H  4.554955 -1.929166 -1.012476
H  2.897949 -2.071707 -1.627099
H  3.231851 -2.314827 0.10368
H  2.884764 2.021829 1.575012
H  3.033329 3.493795 0.600635
H  4.202294 2.175554 0.38719
elementType: S P O C H
totalener: -1676.50145088 hartree
nucrepener: 1266.27365226 hartree
electener: -2942.77510314 hartree
oneelecener: -4827.76967181 hartree
twoeener: 1884.99456866 hartree
cpcmener: -0.04481509 hartree
kineticenergy: 1671.86207267 hartree
xcener: -105.492144903069 hartree
chargesum: 0.0000000
charge: 0.483601 -0.195772 0.850418 -0.350393 -0.350242 -0.707430 -0.638927 -0.185298 -0.085934 -0.098964 -0.287205 -0.108119 -0.102510 0.128690 0.122043 0.131194 0.139128 0.105119 0.117102 0.095544 0.102042 0.104145 0.130029 0.120527 0.118497 0.109973 0.128749 0.123997
qa: 0.4836 -0.1958 0.8504 -0.3504 -0.3502 -0.7074 -0.6389 -0.1853 -0.0859 -0.0990 -0.2872 -0.1081 -0.1025 0.1287 0.1220 0.1312 0.1391 0.1051 0.1171 0.0955 0.1020 0.1041 0.1300 0.1205 0.1185 0.1100 0.1287 0.1240
va: 3.5486 2.2530 5.5013 2.0894 2.0936 1.6653 1.9660 3.9461 3.8139 3.8721 3.9676 3.8434 3.8322 1.0159 1.0335 1.0195 1.0284 1.0198 1.0099 1.0045 0.9971 0.9997 0.9906 0.9938 0.9891 0.9997 0.9899 0.9913
dispcorr: -0.011145991 hartree
energy: -1676.512596875335
dipole: -4.59004 6.24192 1.65188 -6.91674 5.61284 -1.30390 -3.29454 3.11709 -0.17745
magnitude: 2.11196 au
magnitude: 5.36817 debye
