program: Orca
programVersion: 5.0.2
elementType: S S P O O O O C C C C C C H H H H H H H H H H H H H H H
charge: 0
multiplicity: 1
keywords: wb97x-d3
keywords: def2-TZVPP
keywords: def2/J RIJCOSX
keywords: DEFGRID2
keywords: scfconv7
keywords: smallprint printgap noloewdin
keywords: NOSOSCF
formula: C6H15O4PS2
InChI: InChI=1/C6H15O4PS2/c1-4-13(8)6-5-12-11(7,9-2)10-3/h4-6H2,1-3H3
28 atoms
S  -3.196977 0.282276 0.883475
S  1.098379 -0.825269 1.174217
P  1.705691 -0.103581 -0.674411
O  3.222425 -0.572145 -0.806872
O  1.729296 1.478443 -0.438774
O  -3.562549 -0.719536 1.963479
O  0.905431 -0.552481 -1.838246
C  -1.38038 0.405407 0.889008
C  -0.703882 -0.945936 0.893022
C  -3.45851 -0.574448 -0.695478
C  -2.917212 0.18891 -1.887762
C  4.198748 -0.327483 0.21476
C  2.049292 2.3400 -1.546753
H  -1.099409 1.024509 0.036212
H  -1.139679 0.966076 1.793993
H  -1.059602 -1.551055 1.726769
H  -0.874886 -1.507411 -0.022734
H  -3.035693 -1.576679 -0.613069
H  -4.543241 -0.679806 -0.757897
H  -3.235679 1.231875 -1.886829
H  -1.829465 0.161304 -1.933149
H  -3.293454 -0.26529 -2.803786
H  5.17033 -0.546005 -0.219861
H  4.041273 -0.990648 1.066554
H  4.185147 0.709171 0.550337
H  3.051161 2.139073 -1.926588
H  2.009631 3.357894 -1.169842
H  1.324215 2.227298 -2.351861
elementType: S P O C H
totalener: -1676.49988543 hartree
nucrepener: 1293.81439153 hartree
electener: -2970.31427696 hartree
oneelecener: -4882.58474650 hartree
twoeener: 1912.27046954 hartree
cpcmener: -0.04572391 hartree
kineticenergy: 1671.86635459 hartree
xcener: -105.492398305472 hartree
chargesum: 0.0000000
charge: 0.476447 -0.187653 0.843686 -0.356656 -0.347961 -0.708282 -0.639590 -0.162410 -0.099165 -0.126790 -0.273349 -0.121937 -0.113690 0.120869 0.144927 0.136224 0.130969 0.107615 0.125986 0.097443 0.085681 0.105684 0.130969 0.119897 0.131818 0.128108 0.129759 0.121400
qa: 0.4764 -0.1877 0.8437 -0.3567 -0.3480 -0.7083 -0.6396 -0.1624 -0.0992 -0.1268 -0.2733 -0.1219 -0.1137 0.1209 0.1449 0.1362 0.1310 0.1076 0.1260 0.0974 0.0857 0.1057 0.1310 0.1199 0.1318 0.1281 0.1298 0.1214
va: 3.5408 2.2727 5.4748 2.0970 2.0362 1.6657 1.9603 3.8530 3.8709 3.8710 3.9461 3.8413 3.8279 1.0272 1.0124 1.0279 1.0237 1.0142 1.0075 1.0064 1.0140 1.0013 0.9902 0.9876 0.9872 0.9888 0.9895 0.9980
dispcorr: -0.012799082 hartree
energy: -1676.512684516101
dipole: -1.49014 3.45202 1.96188 4.97715 -3.15265 1.82449 -7.08194 6.19469 -0.88726
magnitude: 2.82223 au
magnitude: 7.17353 debye
