program: Orca
programVersion: 5.0.2
elementType: S S P O O O O C C C C C C H H H H H H H H H H H H H H H
charge: 0
multiplicity: 1
keywords: wb97x-d3
keywords: def2-TZVPP
keywords: def2/J RIJCOSX
keywords: DEFGRID2
keywords: scfconv7
keywords: smallprint printgap noloewdin
keywords: NOSOSCF
formula: C6H15O4PS2
InChI: InChI=1/C6H15O4PS2/c1-4-13(8)6-5-12-11(7,9-2)10-3/h4-6H2,1-3H3
28 atoms
S  -3.041948 -0.298388 0.33565
S  1.173597 0.444547 1.434817
P  1.80683 0.899661 -0.496174
O  1.873163 -0.450859 -1.330689
O  3.345154 1.247782 -0.275593
O  -3.483587 -0.768679 1.708524
O  0.964237 1.906273 -1.179607
C  -1.226224 -0.423645 0.316332
C  -0.634453 0.621154 1.239585
C  -3.382997 -1.663372 -0.810984
C  -3.102044 -1.293505 -2.253753
C  2.607438 -1.603217 -0.902433
C  3.732373 2.526843 0.249418
H  -0.958944 -1.435845 0.624984
H  -0.911287 -0.267581 -0.715552
H  -0.856743 1.633615 0.906363
H  -1.020431 0.509326 2.253295
H  -2.812568 -2.533707 -0.481091
H  -4.443209 -1.876847 -0.663643
H  -3.646558 -0.398541 -2.554367
H  -2.042077 -1.130582 -2.44443
H  -3.425936 -2.107807 -2.901001
H  2.325967 -1.898715 0.108939
H  3.680328 -1.420947 -0.945136
H  2.35395 -2.407571 -1.587294
H  4.818342 2.54419 0.260251
H  3.363275 2.663692 1.2662
H  3.366482 3.335477 -0.381882
elementType: S P O C H
totalener: -1676.50204796 hartree
nucrepener: 1280.49629024 hartree
electener: -2956.99833820 hartree
oneelecener: -4855.96860263 hartree
twoeener: 1898.97026444 hartree
cpcmener: -0.04544246 hartree
kineticenergy: 1671.87413452 hartree
xcener: -105.494398316289 hartree
chargesum: -0.0000000
charge: 0.486189 -0.188922 0.847946 -0.345985 -0.353185 -0.706266 -0.640871 -0.183605 -0.089309 -0.099870 -0.283128 -0.105776 -0.107923 0.127755 0.120590 0.131536 0.136731 0.106503 0.115803 0.095289 0.099776 0.103410 0.108210 0.129550 0.130116 0.130577 0.112309 0.122550
qa: 0.4862 -0.1889 0.8479 -0.3460 -0.3532 -0.7063 -0.6409 -0.1836 -0.0893 -0.0999 -0.2831 -0.1058 -0.1079 0.1278 0.1206 0.1315 0.1367 0.1065 0.1158 0.0953 0.0998 0.1034 0.1082 0.1296 0.1301 0.1306 0.1123 0.1225
va: 3.5537 2.2641 5.4860 2.0760 2.0971 1.6673 1.9664 3.9220 3.8202 3.8697 3.9696 3.8275 3.8407 1.0194 1.0264 1.0241 1.0272 1.0184 1.0106 1.0044 0.9991 0.9997 0.9999 0.9924 0.9887 0.9899 0.9946 0.9939
dispcorr: -0.011656999 hartree
energy: -1676.513704955460
dipole: -2.51654 4.45858 1.94204 -7.23508 5.99527 -1.23981 -5.94152 5.08578 -0.85574
magnitude: 2.45783 au
magnitude: 6.24730 debye
