program: Orca
programVersion: 5.0.2
elementType: S S P O O O O C C C C C C H H H H H H H H H H H H H H H
charge: 0
multiplicity: 1
keywords: wb97x-d3
keywords: def2-TZVPP
keywords: def2/J RIJCOSX
keywords: DEFGRID2
keywords: scfconv7
keywords: smallprint printgap noloewdin
keywords: NOSOSCF
formula: C6H15O4PS2
InChI: InChI=1/C6H15O4PS2/c1-4-13(8)6-5-12-11(7,9-2)10-3/h4-6H2,1-3H3
28 atoms
S  -3.123055 -0.461949 0.512336
S  1.155194 0.241934 1.447594
P  1.666041 0.657107 -0.525778
O  2.247433 -0.677362 -1.160867
O  2.967919 1.559475 -0.358677
O  -3.036869 -1.90689 0.958124
O  0.55404 1.189017 -1.342348
C  -1.595202 0.358827 1.090803
C  -0.43713 -0.616038 1.151898
C  -2.761055 -0.439082 -1.270127
C  -3.760972 -1.303091 -2.010838
C  3.333458 -1.416365 -0.595671
C  2.868576 2.941051 0.011088
H  -1.409821 1.196267 0.418371
H  -1.807934 0.765458 2.080353
H  -0.55155 -1.300969 1.989694
H  -0.340155 -1.228554 0.256643
H  -2.826651 0.605645 -1.580236
H  -1.739387 -0.784131 -1.436567
H  -3.686015 -2.34749 -1.711083
H  -4.787466 -0.970653 -1.85068
H  -3.561516 -1.252391 -3.08111
H  3.214742 -1.54914 0.480976
H  4.284384 -0.924162 -0.797138
H  3.329857 -2.394645 -1.06997
H  2.63975 3.045394 1.072021
H  2.109224 3.457373 -0.57584
H  3.837681 3.390711 -0.188875
elementType: S P O C H
totalener: -1676.50343500 hartree
nucrepener: 1289.58356499 hartree
electener: -2966.08699999 hartree
oneelecener: -4874.50903501 hartree
twoeener: 1908.42203502 hartree
cpcmener: -0.03329219 hartree
kineticenergy: 1671.86813970 hartree
xcener: -105.491779972561 hartree
chargesum: 0.0000000
charge: 0.464804 -0.197801 0.840365 -0.343243 -0.349711 -0.678190 -0.609972 -0.159926 -0.106714 -0.137193 -0.259377 -0.106858 -0.110563 0.122681 0.145245 0.135777 0.127593 0.114448 0.105408 0.090540 0.092506 0.097954 0.108065 0.122963 0.127761 0.115357 0.119596 0.128487
qa: 0.4648 -0.1978 0.8404 -0.3432 -0.3497 -0.6782 -0.6100 -0.1599 -0.1067 -0.1372 -0.2594 -0.1069 -0.1106 0.1227 0.1452 0.1358 0.1276 0.1144 0.1054 0.0905 0.0925 0.0980 0.1081 0.1230 0.1278 0.1154 0.1196 0.1285
va: 3.5299 2.2543 5.5144 2.0945 2.0987 1.7017 2.0004 3.8503 3.8716 3.9016 3.9471 3.8385 3.8494 1.0329 1.0083 1.0221 1.0202 1.0164 1.0207 1.0203 1.0029 1.0023 1.0006 0.9912 0.9894 0.9901 0.9944 0.9903
dispcorr: -0.012144328 hartree
energy: -1676.515579325162
dipole: -2.74907 4.59754 1.84847 -1.38315 2.64407 1.26092 -4.73270 4.93757 0.20487
magnitude: 2.24694 au
magnitude: 5.71126 debye
