program: Orca
programVersion: 5.0.2
elementType: S S P O O O O C C C C C C H H H H H H H H H H H H H H H
charge: 0
multiplicity: 1
keywords: wb97x-d3
keywords: def2-TZVPP
keywords: def2/J RIJCOSX
keywords: DEFGRID2
keywords: scfconv7
keywords: smallprint printgap noloewdin
keywords: NOSOSCF
formula: C6H15O4PS2
InChI: InChI=1/C6H15O4PS2/c1-4-13(8)6-5-12-11(7,9-2)10-3/h4-6H2,1-3H3
28 atoms
S  -2.063297 0.536826 0.607769
S  1.025256 -0.356916 1.384607
P  1.532791 -0.382506 -0.636243
O  3.035436 0.145647 -0.599898
O  0.771317 0.812771 -1.355985
O  -2.722114 0.623343 1.966777
O  1.268339 -1.668685 -1.312884
C  -1.518669 -1.186975 0.451364
C  -0.397196 -1.507194 1.415619
C  -3.386044 0.469918 -0.637765
C  -2.841511 0.515519 -2.052976
C  4.091218 -0.697484 -0.119251
C  0.861966 2.171021 -0.917718
H  -2.379194 -1.82079 0.681566
H  -1.228559 -1.378608 -0.58101
H  -0.74954 -1.459255 2.446432
H  -0.039785 -2.520421 1.240085
H  -3.996783 -0.415927 -0.450916
H  -3.999099 1.349271 -0.430074
H  -3.672206 0.548124 -2.758084
H  -2.233691 1.404246 -2.223466
H  -2.242407 -0.35978 -2.302532
H  4.034304 -0.817392 0.963366
H  5.027227 -0.206287 -0.373097
H  4.064788 -1.678827 -0.593529
H  0.712754 2.260089 0.159168
H  0.073466 2.720237 -1.425779
H  1.826911 2.599439 -1.187647
elementType: S P O C H
totalener: -1676.50325385 hartree
nucrepener: 1345.87093813 hartree
electener: -3022.37419198 hartree
oneelecener: -4987.08034539 hartree
twoeener: 1964.70615341 hartree
cpcmener: -0.03576878 hartree
kineticenergy: 1671.89085998 hartree
xcener: -105.498439689255 hartree
chargesum: -0.0000000
charge: 0.503129 -0.196952 0.844682 -0.349972 -0.339085 -0.690689 -0.610560 -0.203635 -0.101731 -0.097715 -0.291730 -0.112814 -0.132276 0.137825 0.120728 0.136682 0.132213 0.099977 0.111163 0.108104 0.093274 0.098933 0.114091 0.128587 0.120876 0.115079 0.124678 0.137140
qa: 0.5031 -0.1970 0.8447 -0.3500 -0.3391 -0.6907 -0.6106 -0.2036 -0.1017 -0.0977 -0.2917 -0.1128 -0.1323 0.1378 0.1207 0.1367 0.1322 0.1000 0.1112 0.1081 0.0933 0.0989 0.1141 0.1286 0.1209 0.1151 0.1247 0.1371
va: 3.6095 2.2542 5.5084 2.1057 2.0782 1.6946 2.0088 3.9385 3.8804 3.8715 3.9668 3.8503 3.8573 1.0155 1.0326 1.0186 1.0155 1.0196 1.0126 1.0020 1.0028 1.0015 0.9922 0.9905 0.9929 0.9906 0.9840 0.9978
dispcorr: -0.013456520 hartree
energy: -1676.516710370713
dipole: -6.27441 6.89071 0.61630 1.08445 -0.86817 0.21627 -5.60554 4.77259 -0.83295
magnitude: 1.05849 au
magnitude: 2.69048 debye
