program: Orca
programVersion: 5.0.2
elementType: S S P O O O O C C C C C C H H H H H H H H H H H H H H H
charge: 0
multiplicity: 1
keywords: wb97x-d3
keywords: def2-TZVPP
keywords: def2/J RIJCOSX
keywords: DEFGRID2
keywords: scfconv7
keywords: smallprint printgap noloewdin
keywords: NOSOSCF
formula: C6H15O4PS2
InChI: InChI=1/C6H15O4PS2/c1-4-13(8)6-5-12-11(7,9-2)10-3/h4-6H2,1-3H3
28 atoms
S  -3.082754 0.306022 0.353287
S  1.211679 -0.446258 1.267302
P  1.970913 0.089878 -0.598851
O  3.530694 -0.18011 -0.419097
O  1.926354 1.674141 -0.725497
O  -3.521183 -0.712744 1.385129
O  1.275524 -0.562821 -1.728453
C  -1.287178 0.555581 0.566228
C  -0.541408 -0.732236 0.838583
C  -3.065925 -0.559361 -1.244244
C  -4.490006 -0.866832 -1.664259
C  4.059134 -1.511557 -0.408547
C  2.532602 2.558484 0.220344
H  -0.938945 1.068461 -0.332166
H  -1.183738 1.247078 1.404334
H  -0.954463 -1.235927 1.712301
H  -0.578347 -1.428475 0.004045
H  -2.566986 0.095339 -1.961786
H  -2.480289 -1.474459 -1.140899
H  -4.998189 -1.489479 -0.928014
H  -5.074609 0.042179 -1.810494
H  -4.483257 -1.412552 -2.607667
H  3.71929 -2.079688 -1.27419
H  3.778273 -2.037728 0.504392
H  5.141601 -1.419653 -0.446284
H  2.2743 2.290949 1.246544
H  2.146316 3.553506 0.012937
H  3.616488 2.566085 0.108854
elementType: S P O C H
totalener: -1676.50493796 hartree
nucrepener: 1277.56475821 hartree
electener: -2954.06969617 hartree
oneelecener: -4850.16876856 hartree
twoeener: 1896.09907239 hartree
cpcmener: -0.03486531 hartree
kineticenergy: 1671.85665748 hartree
xcener: -105.489516058969 hartree
chargesum: -0.0000000
charge: 0.468591 -0.198622 0.830755 -0.346657 -0.341603 -0.679234 -0.610882 -0.150615 -0.100487 -0.143100 -0.259779 -0.111259 -0.106831 0.120614 0.137358 0.129639 0.127121 0.115125 0.114623 0.091511 0.093430 0.097276 0.121609 0.113193 0.128113 0.107105 0.127436 0.125572
qa: 0.4686 -0.1986 0.8308 -0.3467 -0.3416 -0.6792 -0.6109 -0.1506 -0.1005 -0.1431 -0.2598 -0.1113 -0.1068 0.1206 0.1374 0.1296 0.1271 0.1151 0.1146 0.0915 0.0934 0.0973 0.1216 0.1132 0.1281 0.1071 0.1274 0.1256
va: 3.5447 2.2603 5.5103 2.0973 2.0821 1.7013 2.0063 3.8571 3.8667 3.9092 3.9337 3.8478 3.8386 1.0333 1.0111 1.0296 1.0263 1.0150 1.0117 1.0193 1.0040 1.0023 0.9931 0.9932 0.9904 1.0001 0.9889 0.9925
dispcorr: -0.011779269 hartree
energy: -1676.516717224485
dipole: -4.95417 6.80075 1.84659 -1.32698 2.22186 0.89488 -3.83059 3.65418 -0.17641
magnitude: 2.05957 au
magnitude: 5.23500 debye
