program: Orca
programVersion: 5.0.2
elementType: S S P O O O O C C C C C C H H H H H H H H H H H H H H H
charge: 0
multiplicity: 1
keywords: wb97x-d3
keywords: def2-TZVPP
keywords: def2/J RIJCOSX
keywords: DEFGRID2
keywords: scfconv7
keywords: smallprint printgap noloewdin
keywords: NOSOSCF
formula: C6H15O4PS2
InChI: InChI=1/C6H15O4PS2/c1-4-13(8)6-5-12-11(7,9-2)10-3/h4-6H2,1-3H3
28 atoms
S  -2.232208 0.344227 0.41861
S  0.895636 -0.348775 1.357766
P  1.874712 -0.057383 -0.447799
O  3.300235 0.504123 0.003183
O  1.175662 1.253079 -1.023636
O  -2.943841 -0.035742 1.700093
O  1.890162 -1.233399 -1.347685
C  -1.365238 -1.153781 -0.133713
C  -0.342945 -1.606746 0.883843
C  -3.48455 0.34857 -0.898485
C  -4.48131 1.465966 -0.666769
C  4.324028 -0.406471 0.420278
C  1.487024 1.704119 -2.3507
H  -2.107284 -1.945697 -0.264044
H  -0.918493 -0.947639 -1.107417
H  -0.829475 -1.87106 1.823328
H  0.169546 -2.496976 0.523577
H  -2.951794 0.478648 -1.842703
H  -3.971594 -0.628577 -0.905615
H  -4.00251 2.445334 -0.667465
H  -5.225635 1.462171 -1.462973
H  -5.009929 1.340835 0.277308
H  4.594327 -1.093209 -0.381004
H  4.014285 -0.97803 1.29613
H  5.191135 0.193807 0.681497
H  2.518828 2.049386 -2.417509
H  0.820653 2.536293 -2.561172
H  1.317741 0.919644 -3.088026
elementType: S P O C H
totalener: -1676.50466675 hartree
nucrepener: 1304.48952048 hartree
electener: -2980.99418723 hartree
oneelecener: -4904.66837935 hartree
twoeener: 1923.67419213 hartree
cpcmener: -0.03651885 hartree
kineticenergy: 1671.88445939 hartree
xcener: -105.491311196166 hartree
chargesum: 0.0000000
charge: 0.486348 -0.172966 0.847272 -0.359489 -0.342753 -0.682404 -0.618271 -0.189371 -0.103922 -0.131084 -0.256654 -0.109585 -0.119463 0.140320 0.117722 0.134455 0.132196 0.113181 0.108607 0.091820 0.096556 0.090839 0.119722 0.109724 0.128205 0.124946 0.126899 0.117150
qa: 0.4863 -0.1730 0.8473 -0.3595 -0.3428 -0.6824 -0.6183 -0.1894 -0.1039 -0.1311 -0.2567 -0.1096 -0.1195 0.1403 0.1177 0.1345 0.1322 0.1132 0.1086 0.0918 0.0966 0.0908 0.1197 0.1097 0.1282 0.1249 0.1269 0.1172
va: 3.5644 2.2757 5.4895 2.0963 2.0768 1.6960 1.9753 3.9280 3.8781 3.9093 3.9323 3.8485 3.8455 1.0131 1.0332 1.0233 1.0220 1.0153 1.0141 1.0036 1.0029 1.0196 0.9960 0.9944 0.9904 0.9909 0.9885 0.9955
dispcorr: -0.011553809 hartree
energy: -1676.516220558574
dipole: -8.49761 9.14732 0.64971 0.81293 -0.74584 0.06709 -8.55719 6.54972 -2.00747
magnitude: 2.11106 au
magnitude: 5.36589 debye
