program: Orca
programVersion: 5.0.2
elementType: S S P O O O O C C C C C C H H H H H H H H H H H H H H H
charge: 0
multiplicity: 1
keywords: wb97x-d3
keywords: def2-TZVPP
keywords: def2/J RIJCOSX
keywords: DEFGRID2
keywords: scfconv7
keywords: smallprint printgap noloewdin
keywords: NOSOSCF
formula: C6H15O4PS2
InChI: InChI=1/C6H15O4PS2/c1-4-13(8)6-5-12-11(7,9-2)10-3/h4-6H2,1-3H3
28 atoms
S  -3.18527 -0.721051 0.83062
S  1.189478 -0.211798 1.436467
P  1.827188 0.414484 -0.433041
O  3.283487 -0.229916 -0.529528
O  2.162196 1.953096 -0.195553
O  -3.812526 -1.977196 0.267681
O  0.907828 0.122834 -1.557132
C  -1.383937 -1.005229 0.761109
C  -0.600673 0.162095 1.321862
C  -3.360216 0.555254 -0.453047
C  -2.959859 0.098989 -1.838608
C  3.446443 -1.603949 -0.902919
C  2.461622 2.803325 -1.314192
H  -1.235524 -1.897866 1.372402
H  -1.101867 -1.250151 -0.262622
H  -0.733442 1.077094 0.746477
H  -0.902951 0.383135 2.346421
H  -4.419973 0.818303 -0.418675
H  -2.806568 1.436018 -0.1216
H  -3.4539 -0.83367 -2.108965
H  -3.263021 0.85165 -2.566663
H  -1.883988 -0.034269 -1.93857
H  2.867413 -1.850303 -1.793154
H  3.154056 -2.266526 -0.086927
H  4.502776 -1.749869 -1.116201
H  2.554718 3.812093 -0.919891
H  1.661647 2.783394 -2.054152
H  3.402282 2.516203 -1.785072
elementType: S P O C H
totalener: -1676.50253912 hartree
nucrepener: 1280.16837143 hartree
electener: -2956.67091055 hartree
oneelecener: -4855.39329092 hartree
twoeener: 1898.72238037 hartree
cpcmener: -0.03573384 hartree
kineticenergy: 1671.86376943 hartree
xcener: -105.488268654979 hartree
chargesum: 0.0000000
charge: 0.473016 -0.176399 0.853190 -0.354592 -0.352391 -0.680523 -0.611715 -0.179848 -0.118737 -0.134065 -0.267576 -0.106005 -0.121054 0.136791 0.122284 0.130473 0.142716 0.123529 0.110891 0.090390 0.104025 0.088978 0.117374 0.111666 0.127605 0.127884 0.117352 0.124745
qa: 0.4730 -0.1764 0.8532 -0.3546 -0.3524 -0.6805 -0.6117 -0.1798 -0.1187 -0.1341 -0.2676 -0.1060 -0.1211 0.1368 0.1223 0.1305 0.1427 0.1235 0.1109 0.0904 0.1040 0.0890 0.1174 0.1117 0.1276 0.1279 0.1174 0.1247
va: 3.5592 2.2626 5.4858 2.0954 2.0906 1.7034 1.9762 3.9043 3.8766 3.8624 3.9198 3.8476 3.8486 1.0187 1.0290 1.0212 1.0092 1.0056 1.0175 1.0257 1.0023 1.0099 0.9965 0.9918 0.9901 0.9883 0.9955 0.9886
dispcorr: -0.012138183 hartree
energy: -1676.514677302059
dipole: -3.24322 5.05324 1.81002 3.38686 -1.44821 1.93865 -9.06389 9.10835 0.04445
magnitude: 2.65265 au
magnitude: 6.74249 debye
