program: Gaussian 09
title: 000058696
version: EM64L-G09RevD.01
frameworkgroup: C1[X(C17H26N2O)]
method: RPBEPBE
basis: SDD
operation: Freq
keyword: #p
keyword: freq=noraman
keyword: PBEPBE/SDD
title: #p freq=noraman PBEPBE/SDD
converged: YES YES NO NO
title: Mulliken charges:
elementType: O N N C C C C C C C C C C C C C C C C C H H H H H H H H H H H H H H H H H H H H H H H H H H
charge: -0.270876 -0.075099 -0.085760 -0.366269 -0.356166 -0.369777 -0.350308 -0.395294 -0.388718 -0.398439 -0.381967 -0.485965 -0.535989 0.272350 0.306375 -0.386213 -0.541694 0.330071 -0.388606 -0.537072 0.197704 0.210273 0.171512 0.202536 0.209428 0.165448 0.187504 0.208297 0.190129 0.204783 0.203410 0.190375 0.212794 0.188713 0.187775 0.213249 0.229395 0.189221 0.208984 0.233495 0.226516 0.255367 0.238845 0.242448 0.218842 0.218373
chargesum: 0.00000
title: Mulliken charges with hydrogens summed into heavy atoms:
elementType: O N N C C C C C C C C C C C C C C C C C
charge: -0.270876 -0.075099 -0.085760 0.041708 0.017882 0.005100 0.045493 -0.000382 0.005067 0.003068 0.019057 -0.067349 -0.093510 0.272350 0.306375 -0.159697 -0.286327 0.330071 -0.149761 0.142591
polarizability: 2.81392840e+02 -8.40180631e+00 1.90948003e+02 -8.63490339e+00 -6.08766790e+00 1.32711172e+02
1716.lowfreq: -25.6305 -7.3816 -4.8412 -0.0009 -0.0007 -0.0006 8.0576 19.9186 35.6534
frequency: -20.1787 19.4234 35.6068 49.7233 81.5618 102.0663 120.9197 125.6514 167.9567 182.8168 202.3591 229.1971 232.3193 241.2774 263.0219 300.1813 326.6318 335.5674 342.4014 370.2552 391.2907 417.8462 436.6670 444.5675 450.6697 482.7120 505.8953 544.1744 562.9339 583.3275 622.8207 706.6827 714.6759 748.4118 759.5759 788.6851 800.2427 804.4620 821.9132 853.3604 855.7342 878.4560 889.7270 906.0088 924.8581 934.4112 957.5304 985.2374 988.9615 997.0674 1008.5712 1044.8504 1050.9282 1058.2403 1071.0637 1090.3113 1104.8242 1109.4139 1112.7789 1118.7588 1140.7126 1143.7247 1144.5126 1150.7673 1157.0571 1174.2983 1191.2514 1203.0386 1216.9903 1229.2138 1248.8082 1252.0399 1259.8642 1264.5987 1265.0776 1273.4882 1290.2369 1297.2594 1320.2426 1328.5264 1334.3492 1336.9592 1338.9420 1346.7004 1353.4532 1371.0901 1379.6226 1394.5782 1399.3865 1429.3337 1438.6194 1442.4947 1449.9725 1458.3216 1459.6963 1463.4767 1464.5802 1465.4808 1466.2241 1473.6259 1474.1110 1479.6512 1484.5585 1500.0266 1587.4321 1628.1319 2788.3240 2814.1737 2824.8457 2844.9859 2866.2109 2884.8047 2954.5875 2965.5496 2980.4806 2983.5359 2985.5150 3007.9740 3016.6633 3021.3786 3030.3990 3033.5585 3035.9537 3037.6416 3040.6471 3041.4665 3044.6821 3053.9505 3112.1127 3120.3651 3142.3714 3161.7373
redmass: 3.0156 4.1949 3.8357 3.5417 3.2616 2.8793 2.7587 3.3531 3.6125 2.6222 2.7068 1.8155 1.2236 2.2578 2.8517 2.1060 2.5909 3.7168 3.5384 2.4515 2.1366 3.3057 2.7414 2.9541 2.9778 3.6453 3.2786 3.9548 2.2591 3.3991 3.3792 3.2542 3.9124 2.9825 3.7303 1.3318 1.3993 1.4206 2.8625 1.4345 2.6961 2.0555 2.4022 2.3557 1.3868 2.3552 1.3025 2.8228 1.7963 2.7608 3.1672 2.1381 1.8591 2.2410 2.6792 1.5995 2.7210 2.3334 1.2605 2.5885 1.5883 1.7752 1.5167 1.4316 2.3065 1.4112 1.1372 1.5407 2.3076 1.3132 1.6201 2.7193 1.3460 1.2659 1.4285 1.2605 1.4000 1.3338 1.3370 1.3100 1.5012 1.4302 1.4489 1.4980 1.5472 1.7378 1.5117 2.7407 1.4372 2.2805 1.4578 1.1134 1.0913 1.0815 1.0873 1.1001 1.0923 1.0504 1.0891 1.0831 1.0803 1.1021 1.0989 2.5554 7.1511 6.9945 1.0715 1.0716 1.0700 1.0709 1.0697 1.0691 1.0331 1.0626 1.0602 1.0614 1.0611 1.0858 1.0860 1.0872 1.0930 1.0907 1.0920 1.0976 1.1038 1.0898 1.1032 1.1035 1.0892 1.0990 1.0916 1.0935
irintensity: 0.3068 0.0693 0.3106 0.1209 4.6926 1.5876 0.4656 2.2618 0.9516 0.7781 2.6008 0.3896 0.4814 3.6715 0.2230 2.0374 9.8086 1.1332 0.4257 2.8231 6.8219 6.2166 3.9961 2.7382 1.2883 1.5475 3.1251 3.3659 1.5434 4.3768 6.8491 3.1637 3.3122 15.0465 2.0827 1.1103 37.7570 0.0619 7.4514 3.4685 7.9686 7.1875 13.8815 4.0543 2.6646 15.6506 3.2724 5.5957 2.7000 58.6184 33.5130 7.9562 8.1378 1.2214 11.2232 7.6727 19.8344 49.8979 0.2576 12.2750 19.4621 109.2013 6.9092 1.9995 34.2977 33.4016 3.4438 2.2462 24.7647 20.2896 3.4563 69.0589 2.0879 28.4813 30.4832 13.0132 10.3477 1.4631 9.9309 1.7761 2.3119 3.1305 0.6120 0.7608 4.0115 3.7631 8.7874 20.9982 2.0310 20.3698 0.5607 10.2610 6.9753 2.6187 13.6242 23.1580 0.3686 12.6481 5.3128 17.7698 25.1354 1.4251 24.8505 95.1679 15.6974 75.7241 69.6847 43.8794 147.2824 72.2294 39.8363 187.6880 76.3144 39.3753 28.0225 34.4113 37.4148 20.0797 7.6228 50.4127 81.9681 16.1472 7.7148 32.1118 53.4557 133.1740 12.4768 100.5640 21.7415 24.5753 6.1131 16.1881
temp: 298.150 k
press: 1.00000 atm
elementType: 8 7 7 6 6 6 6 6 6 6 6 6 6 6 6 6 6 6 6 6 1 1 1 1 1 1 1 1 1 1 1 1 1 1 1 1 1 1 1 1 1 1 1 1 1 1
symmnumber: 1
zpe: 1052857.5 jmol-1
zpe.correction: 0.401012 hartree
zpe.thermalcorrener: 0.419561 hartree
zpe.thermalcorrenthalpy: 0.420505 hartree
zpe.thermalcorrgfe: 0.353588 hartree
zpe.sumelectzpe: -846.550109 hartree
zpe.sumelectthermal: -846.531560 hartree
zpe.sumelectthermalent: -846.530616 hartree
zpe.sumelectthermalfe: -846.597533 hartree
dipole: -0.1938 -1.3726 0.2120
dipole: 1.4023
quadrupole: -109.2552 -111.9731 -126.1570
quadrupole: -10.4245 3.0638 -0.1548
quadrupole: 6.5399 3.8220 -10.3619 -10.4245 3.0638 -0.1548
hfenergy: -846.9511212 hartree
pointgroup: C01 [X(C17H26N2O1)]
dipole: 0.0814306 0.5393603 0.0827461 debye
polarizability: 281.3124069|-9.1756932|191.1118551|8.0105654|6.0204398|132.6277532 unknown
InChI: InChI=1S/C17H26N2O/c1-20-17-6-5-16-14-19(10-7-15(16)13-17)12-11-18-8-3-2-4-9-18/h5-6,13H,2-4,7-12,14H2,1H3
charge 0 multiplicity 1
46 atoms
O  -6.19471 0.071666 -0.389374
N  3.907307 0.268427 0.049282
N  0.22714 -0.772222 0.147571
C  2.457994 0.320068 -0.268953
C  4.603572 -0.84881 -0.639939
C  4.594789 1.560158 -0.208687
C  1.654889 -0.721743 0.543095
C  6.065644 -0.973247 -0.165039
C  6.056725 1.518895 0.282103
C  6.825757 0.354803 -0.383869
C  -0.458607 -2.0037 0.610775
C  -0.516278 0.439103 0.567161
C  -1.803959 -2.154545 -0.120844
C  -2.01378 0.350884 0.292271
C  -2.641873 -0.888457 -0.013831
C  -2.80847 1.516504 0.368772
C  -4.03603 -0.930021 -0.230368
C  -4.818102 0.245088 -0.151974
C  -4.20345 1.485438 0.150445
C  -7.042418 1.262188 -0.322393
H  2.252492 0.157209 -1.355834
H  2.09954 1.336614 -0.020783
H  4.589607 -0.697068 -1.753334
H  4.063167 -1.790649 -0.435011
H  4.041629 2.359146 0.320154
H  4.584798 1.814924 -1.302998
H  1.788513 -0.498303 1.631695
H  2.084408 -1.724873 0.364336
H  6.560376 -1.800997 -0.709324
H  6.068646 -1.229208 0.912167
H  6.056818 1.380611 1.380768
H  6.546569 2.487675 0.063804
H  7.85393 0.2866 0.019434
H  6.916941 0.550056 -1.472862
H  -0.628052 -1.993099 1.718905
H  0.191003 -2.868655 0.384098
H  -0.104117 1.314745 0.031894
H  -0.360853 0.634861 1.664524
H  -2.363233 -3.020099 0.283546
H  -1.597553 -2.365762 -1.188385
H  -2.331059 2.476815 0.602976
H  -4.538246 -1.875284 -0.464254
H  -4.784371 2.410158 0.215509
H  -8.06009 0.903628 -0.537234
H  -6.744709 2.013758 -1.07997
H  -7.014997 1.722721 0.684878
