program: Orca
programVersion: 5.0.2
elementType: S S P O O O O C C C C C C H H H H H H H H H H H H H H H
charge: 0
multiplicity: 1
keywords: wb97x-d3
keywords: def2-TZVPP
keywords: def2/J RIJCOSX
keywords: DEFGRID2
keywords: scfconv7
keywords: smallprint printgap noloewdin
keywords: NOSOSCF
formula: C6H15O4PS2
InChI: InChI=1/C6H15O4PS2/c1-4-13(8)6-5-12-11(7,9-2)10-3/h4-6H2,1-3H3
28 atoms
S  -3.190171 -0.171038 0.066517
S  0.926413 0.402251 1.54741
P  1.886578 0.557707 -0.285664
O  1.971525 -0.955203 -0.779526
O  3.399852 0.838407 0.136818
O  -3.762915 -0.16426 1.466934
O  1.28049 1.520569 -1.233479
C  -1.396247 -0.442142 0.260297
C  -0.806977 0.7018 1.059617
C  -3.602992 -1.788502 -0.647466
C  -3.060887 -1.967395 -2.052325
C  2.489021 -1.258302 -2.084569
C  3.813572 2.153741 0.524479
H  -1.251171 -1.400004 0.764078
H  -0.965485 -0.491389 -0.740377
H  -0.872112 1.650498 0.528369
H  -1.328564 0.815369 2.010927
H  -3.248149 -2.557671 0.041956
H  -4.694861 -1.812096 -0.643378
H  -3.495892 -2.862404 -2.496928
H  -3.318288 -1.126257 -2.697392
H  -1.978646 -2.090937 -2.06665
H  3.556062 -1.042404 -2.143407
H  1.961801 -0.704129 -2.861088
H  2.333115 -2.322656 -2.241302
H  4.900127 2.144074 0.563061
H  3.425131 2.408335 1.511736
H  3.490211 2.905559 -0.195629
elementType: S P O C H
totalener: -1676.50428395 hartree
nucrepener: 1271.85082259 hartree
electener: -2948.35510654 hartree
oneelecener: -4838.84883419 hartree
twoeener: 1890.49372765 hartree
cpcmener: -0.03542383 hartree
kineticenergy: 1671.86406279 hartree
xcener: -105.486954552351 hartree
chargesum: 0.0000000
charge: 0.480932 -0.171427 0.839413 -0.348472 -0.358977 -0.680278 -0.615622 -0.186448 -0.099419 -0.103718 -0.285768 -0.116567 -0.107834 0.127031 0.118505 0.132521 0.133244 0.102910 0.116371 0.103911 0.094523 0.099164 0.126098 0.116882 0.127330 0.127765 0.110809 0.117120
qa: 0.4809 -0.1714 0.8394 -0.3485 -0.3590 -0.6803 -0.6156 -0.1864 -0.0994 -0.1037 -0.2858 -0.1166 -0.1078 0.1270 0.1185 0.1325 0.1332 0.1029 0.1164 0.1039 0.0945 0.0992 0.1261 0.1169 0.1273 0.1278 0.1108 0.1171
va: 3.5709 2.2798 5.4963 2.0662 2.0975 1.7038 1.9773 3.9161 3.8371 3.8698 3.9620 3.8400 3.8504 1.0167 1.0308 1.0240 1.0323 1.0213 1.0106 1.0000 1.0053 0.9971 0.9913 0.9961 0.9882 0.9899 0.9929 0.9958
dispcorr: -0.011357047 hartree
energy: -1676.515640995584
dipole: -2.96032 4.48631 1.52598 -6.93261 5.72218 -1.21043 -9.28413 7.73351 -1.55061
magnitude: 2.48961 au
magnitude: 6.32809 debye
