program: Orca
programVersion: 5.0.2
elementType: S S P O O O O C C C C C C H H H H H H H H H H H H H H H
charge: 0
multiplicity: 1
keywords: wb97x-d3
keywords: def2-TZVPP
keywords: def2/J RIJCOSX
keywords: DEFGRID2
keywords: scfconv7
keywords: smallprint printgap noloewdin
keywords: NOSOSCF
formula: C6H15O4PS2
InChI: InChI=1/C6H15O4PS2/c1-4-13(8)6-5-12-11(7,9-2)10-3/h4-6H2,1-3H3
28 atoms
S  -2.047846 0.42158 0.43721
S  0.973535 -0.416027 1.461176
P  1.775239 -0.234559 -0.440463
O  3.157914 0.508446 -0.158175
O  0.910081 0.935954 -1.089487
O  -2.892338 0.259234 1.682798
O  1.843757 -1.496248 -1.213217
C  -1.365588 -1.224323 0.092369
C  -0.356009 -1.63503 1.142919
C  -3.182482 0.476618 -0.978902
C  -4.054027 1.713632 -0.890713
C  4.314585 -0.237465 0.240117
C  0.947401 1.16869 -2.504921
H  -2.196398 -1.934701 0.098609
H  -0.938171 -1.223432 -0.910899
H  -0.838859 -1.76108 2.112284
H  0.090725 -2.590765 0.873874
H  -2.558955 0.491494 -1.876254
H  -3.779709 -0.437627 -0.983741
H  -4.726913 1.749254 -1.74738
H  -4.667266 1.707488 0.009748
H  -3.461021 2.628797 -0.897514
H  4.555858 -1.014965 -0.484228
H  4.174088 -0.689456 1.22302
H  5.139561 0.468512 0.291735
H  0.244692 1.974001 -2.703688
H  0.642055 0.284092 -3.063311
H  1.94167 1.477499 -2.82935
elementType: S P O C H
totalener: -1676.50332075 hartree
nucrepener: 1323.44318445 hartree
electener: -2999.94650520 hartree
oneelecener: -4942.42380768 hartree
twoeener: 1942.47730248 hartree
cpcmener: -0.03756914 hartree
kineticenergy: 1671.89498059 hartree
xcener: -105.494131721078 hartree
chargesum: -0.0000000
charge: 0.499985 -0.171225 0.845892 -0.361326 -0.340739 -0.688043 -0.617551 -0.187269 -0.113486 -0.136728 -0.254656 -0.108965 -0.127378 0.140382 0.113078 0.136756 0.134373 0.112072 0.109393 0.096369 0.090822 0.091168 0.118840 0.110739 0.127957 0.126768 0.119387 0.133386
qa: 0.5000 -0.1712 0.8459 -0.3613 -0.3407 -0.6880 -0.6176 -0.1873 -0.1135 -0.1367 -0.2547 -0.1090 -0.1274 0.1404 0.1131 0.1368 0.1344 0.1121 0.1094 0.0964 0.0908 0.0912 0.1188 0.1107 0.1280 0.1268 0.1194 0.1334
va: 3.5767 2.2786 5.4989 2.1012 2.0656 1.6913 1.9751 3.9326 3.8884 3.9146 3.9307 3.8490 3.8396 1.0152 1.0304 1.0183 1.0186 1.0139 1.0136 1.0032 1.0205 1.0035 0.9961 0.9931 0.9898 0.9879 0.9943 0.9913
dispcorr: -0.012346983 hartree
energy: -1676.515667736111
dipole: -8.45952 9.08557 0.62604 1.24411 -1.33653 -0.09243 -9.29689 7.24063 -2.05627
magnitude: 2.15144 au
magnitude: 5.46853 debye
