program: Orca
programVersion: 5.0.2
elementType: S S P O O O O C C C C C C H H H H H H H H H H H H H H H
charge: 0
multiplicity: 1
keywords: wb97x-d3
keywords: def2-TZVPP
keywords: def2/J RIJCOSX
keywords: DEFGRID2
keywords: scfconv7
keywords: smallprint printgap noloewdin
keywords: NOSOSCF
formula: C6H15O4PS2
InChI: InChI=1/C6H15O4PS2/c1-4-13(8)6-5-12-11(7,9-2)10-3/h4-6H2,1-3H3
28 atoms
S  -1.989258 0.645297 0.409042
S  1.015652 -0.477332 1.293055
P  1.792148 -0.338961 -0.634866
O  3.252985 0.237203 -0.364322
O  1.074434 0.879026 -1.364361
O  -2.813938 0.508931 1.670419
O  1.672719 -1.58359 -1.421184
C  -1.445744 -1.035821 -0.006859
C  -0.4345 -1.553185 0.995159
C  -3.14531 0.897259 -0.973016
C  -4.334697 -0.039058 -0.979483
C  4.284316 -0.597277 0.179902
C  1.076324 2.211532 -0.844688
H  -2.316412 -1.694401 0.016513
H  -1.055806 -1.031935 -1.025291
H  -0.891845 -1.662728 1.978988
H  -0.087193 -2.538085 0.687695
H  -3.467936 1.935551 -0.871424
H  -2.552987 0.832705 -1.888856
H  -4.056349 -1.064709 -1.218533
H  -4.851298 -0.033296 -0.01951
H  -5.047508 0.289364 -1.737097
H  5.205472 -0.020145 0.148283
H  4.410754 -1.505324 -0.410211
H  4.06846 -0.864821 1.215533
H  0.876231 2.231841 0.227592
H  0.285052 2.752474 -1.357388
H  2.030005 2.699283 -1.044663
elementType: S P O C H
totalener: -1676.50391908 hartree
nucrepener: 1329.21660282 hartree
electener: -3005.72052190 hartree
oneelecener: -4953.72184713 hartree
twoeener: 1948.00132523 hartree
cpcmener: -0.03602174 hartree
kineticenergy: 1671.87760096 hartree
xcener: -105.496133291061 hartree
chargesum: 0.0000000
charge: 0.496662 -0.197451 0.843916 -0.349172 -0.344553 -0.689104 -0.610615 -0.206547 -0.103917 -0.113807 -0.272927 -0.112041 -0.135959 0.141600 0.121118 0.139008 0.132994 0.120436 0.110120 0.093137 0.088650 0.104621 0.128183 0.121604 0.113631 0.114883 0.130351 0.135180
qa: 0.4967 -0.1975 0.8439 -0.3492 -0.3446 -0.6891 -0.6106 -0.2065 -0.1039 -0.1138 -0.2729 -0.1120 -0.1360 0.1416 0.1211 0.1390 0.1330 0.1204 0.1101 0.0931 0.0886 0.1046 0.1282 0.1216 0.1136 0.1149 0.1304 0.1352
va: 3.5841 2.2544 5.5071 2.1022 2.0663 1.6975 2.0102 3.9457 3.8870 3.8639 3.9380 3.8486 3.8515 1.0102 1.0282 1.0163 1.0187 1.0041 1.0199 0.9966 1.0233 1.0017 0.9901 0.9929 0.9922 0.9943 0.9837 0.9970
dispcorr: -0.012922343 hartree
energy: -1676.516841423179
dipole: -9.57215 10.11479 0.54264 0.89969 -0.34961 0.55009 -3.74304 2.96419 -0.77885
magnitude: 1.09711 au
magnitude: 2.78864 debye
