program: Orca
programVersion: 5.0.2
elementType: S S P O O O O C C C C C C H H H H H H H H H H H H H H H
charge: 0
multiplicity: 1
keywords: wb97x-d3
keywords: def2-TZVPP
keywords: def2/J RIJCOSX
keywords: DEFGRID2
keywords: scfconv7
keywords: smallprint printgap noloewdin
keywords: NOSOSCF
formula: C6H15O4PS2
InChI: InChI=1/C6H15O4PS2/c1-4-13(8)6-5-12-11(7,9-2)10-3/h4-6H2,1-3H3
28 atoms
S  -2.909967 0.055596 -0.694516
S  1.098906 -0.853726 1.015091
P  2.096157 0.299961 -0.412035
O  3.622326 0.004146 -0.062032
O  1.956497 1.83115 -0.010592
O  -3.582122 1.406708 -0.587458
O  1.636234 0.064428 -1.79606
C  -1.355143 0.213992 0.245758
C  -0.526665 -1.053047 0.206482
C  -3.802357 -1.048002 0.439037
C  -5.25343 -1.151426 0.011696
C  4.204326 -1.280011 -0.320553
C  2.325515 2.342147 1.27297
H  -0.84233 1.045171 -0.241731
H  -1.601509 0.516138 1.265343
H  -0.999597 -1.856395 0.772039
H  -0.370286 -1.414046 -0.809319
H  -3.311286 -2.022266 0.401662
H  -3.707989 -0.64613 1.450219
H  -5.353161 -1.545609 -1.000328
H  -5.783061 -1.827635 0.682476
H  -5.753039 -0.184663 0.055645
H  3.963623 -1.633843 -1.323195
H  3.86904 -2.014377 0.412313
H  5.281479 -1.160348 -0.236323
H  1.9013 3.340224 1.348483
H  3.40887 2.405744 1.370918
H  1.922224 1.730275 2.082166
elementType: S P O C H
totalener: -1676.50354334 hartree
nucrepener: 1265.83655712 hartree
electener: -2942.34010047 hartree
oneelecener: -4826.62257078 hartree
twoeener: 1884.28247031 hartree
cpcmener: -0.04050992 hartree
kineticenergy: 1671.86061967 hartree
xcener: -105.488992780750 hartree
chargesum: 0.0000000
charge: 0.482336 -0.200422 0.828115 -0.345220 -0.338666 -0.679257 -0.607702 -0.152290 -0.122325 -0.142269 -0.258560 -0.112402 -0.107824 0.125929 0.121258 0.148204 0.129039 0.109563 0.114990 0.092616 0.096867 0.092515 0.121615 0.114231 0.128236 0.128069 0.125811 0.107543
qa: 0.4823 -0.2004 0.8281 -0.3452 -0.3387 -0.6793 -0.6077 -0.1523 -0.1223 -0.1423 -0.2586 -0.1124 -0.1078 0.1259 0.1213 0.1482 0.1290 0.1096 0.1150 0.0926 0.0969 0.0925 0.1216 0.1142 0.1282 0.1281 0.1258 0.1075
va: 3.5718 2.2530 5.5144 2.0958 2.0864 1.7029 2.0107 3.8757 3.8852 3.9076 3.9402 3.8518 3.8376 1.0321 1.0253 0.9985 1.0317 1.0162 1.0090 1.0023 1.0022 1.0223 0.9922 0.9918 0.9912 0.9892 0.9922 0.9998
dispcorr: -0.011284000 hartree
energy: -1676.514827342563
dipole: -8.93324 10.16868 1.23544 -5.54242 3.29816 -2.24426 6.87500 -4.27693 2.59807
magnitude: 3.64869 au
magnitude: 9.27424 debye
