program: Orca
programVersion: 5.0.2
elementType: S S P O O O O C C C C C C H H H H H H H H H H H H H H H
charge: 0
multiplicity: 1
keywords: wb97x-d3
keywords: def2-TZVPP
keywords: def2/J RIJCOSX
keywords: DEFGRID2
keywords: scfconv7
keywords: smallprint printgap noloewdin
keywords: NOSOSCF
formula: C6H15O4PS2
InChI: InChI=1/C6H15O4PS2/c1-4-13(8)6-5-12-11(7,9-2)10-3/h4-6H2,1-3H3
28 atoms
S  -3.075838 0.16728 0.468325
S  1.266186 -0.416555 1.252801
P  1.937781 0.22997 -0.612397
O  3.503441 -0.051848 -0.513374
O  1.887404 1.818694 -0.639172
O  -3.395773 -1.062908 1.291751
O  1.199544 -0.3527 -1.752075
C  -1.29699 0.518066 0.700487
C  -0.489301 -0.749442 0.876903
C  -3.007108 -0.366375 -1.26842
C  -4.349914 -0.936727 -1.682184
C  4.015219 -1.387612 -0.607388
C  2.522891 2.643375 0.340605
H  -0.980961 1.111835 -0.159119
H  -1.22167 1.149328 1.587289
H  -0.844881 -1.308576 1.74191
H  -0.539626 -1.411015 0.01481
H  -2.753313 0.521259 -1.85227
H  -2.209057 -1.100372 -1.39589
H  -5.154436 -0.207283 -1.574182
H  -4.311798 -1.233109 -2.730733
H  -4.606488 -1.820845 -1.099435
H  3.721697 -1.983904 0.258341
H  5.099744 -1.307535 -0.632219
H  3.672287 -1.879357 -1.51871
H  2.292865 2.314255 1.356119
H  2.132896 3.649474 0.205575
H  3.603821 2.656822 0.199021
elementType: S P O C H
totalener: -1676.50460289 hartree
nucrepener: 1280.38146141 hartree
electener: -2956.88606430 hartree
oneelecener: -4855.88516248 hartree
twoeener: 1898.99909818 hartree
cpcmener: -0.03441414 hartree
kineticenergy: 1671.85292854 hartree
xcener: -105.488471604764 hartree
chargesum: -0.0000000
charge: 0.465896 -0.197982 0.830847 -0.346802 -0.341540 -0.676405 -0.609904 -0.151575 -0.099068 -0.138720 -0.261691 -0.110528 -0.107548 0.119323 0.137959 0.126992 0.128623 0.112537 0.115545 0.092526 0.097802 0.091699 0.111866 0.128225 0.121514 0.107571 0.127280 0.125560
qa: 0.4659 -0.1980 0.8308 -0.3468 -0.3415 -0.6764 -0.6099 -0.1516 -0.0991 -0.1387 -0.2617 -0.1105 -0.1075 0.1193 0.1380 0.1270 0.1286 0.1125 0.1155 0.0925 0.0978 0.0917 0.1119 0.1282 0.1215 0.1076 0.1273 0.1256
va: 3.5371 2.2615 5.5086 2.0962 2.0829 1.7049 2.0065 3.8580 3.8750 3.9024 3.9418 3.8465 3.8389 1.0305 1.0114 1.0302 1.0221 1.0169 1.0115 1.0026 1.0026 1.0199 0.9945 0.9904 0.9932 0.9998 0.9890 0.9922
dispcorr: -0.011820518 hartree
energy: -1676.516423409923
dipole: -4.65563 6.44229 1.78666 -1.01889 2.19506 1.17616 -3.98048 3.94835 -0.03213
magnitude: 2.13928 au
magnitude: 5.43763 debye
