program: Orca
programVersion: 5.0.2
elementType: S S P O O O O C C C C C C H H H H H H H H H H H H H H H
charge: 0
multiplicity: 1
keywords: wb97x-d3
keywords: def2-TZVPP
keywords: def2/J RIJCOSX
keywords: DEFGRID2
keywords: scfconv7
keywords: smallprint printgap noloewdin
keywords: NOSOSCF
formula: C6H15O4PS2
InChI: InChI=1/C6H15O4PS2/c1-4-13(8)6-5-12-11(7,9-2)10-3/h4-6H2,1-3H3
28 atoms
S  -2.579316 -0.030841 0.39569
S  0.721228 0.302859 1.00933
P  1.988032 0.083774 -0.626601
O  3.210416 -0.828577 -0.18361
O  2.649649 1.529062 -0.723712
O  -3.144597 -0.515294 1.71434
O  1.335791 -0.464378 -1.833692
C  -1.337032 -1.263108 -0.087421
C  -0.193635 -1.280755 0.901446
C  -3.798242 -0.437377 -0.887277
C  -5.066021 0.362497 -0.666664
C  4.059592 -0.53193 0.926551
C  1.939332 2.63825 -1.288814
H  -1.82496 -2.241382 -0.092115
H  -0.998549 -1.035118 -1.097426
H  -0.555752 -1.471103 1.912199
H  0.498177 -2.088043 0.662258
H  -3.337476 -0.200227 -1.848559
H  -3.987884 -1.512046 -0.847624
H  -4.882151 1.436568 -0.712264
H  -5.79241 0.118685 -1.441682
H  -5.521223 0.1317 0.295927
H  4.633409 -1.43204 1.13336
H  3.484585 -0.271205 1.81663
H  4.745348 0.280395 0.686623
H  2.677645 3.403367 -1.515872
H  1.217504 3.040058 -0.577225
H  1.424699 2.358314 -2.207989
elementType: S P O C H
totalener: -1676.50518062 hartree
nucrepener: 1284.83561802 hartree
electener: -2961.34079864 hartree
oneelecener: -4865.16161876 hartree
twoeener: 1903.82082012 hartree
cpcmener: -0.03558484 hartree
kineticenergy: 1671.88670956 hartree
xcener: -105.495098867744 hartree
chargesum: 0.0000000
charge: 0.479652 -0.198258 0.840417 -0.343143 -0.347094 -0.681545 -0.610712 -0.186794 -0.098797 -0.131663 -0.256697 -0.105331 -0.109340 0.133541 0.125521 0.134612 0.132067 0.114800 0.109183 0.091373 0.096698 0.091777 0.126822 0.107747 0.121546 0.128334 0.116232 0.119050
qa: 0.4797 -0.1983 0.8404 -0.3431 -0.3471 -0.6815 -0.6107 -0.1868 -0.0988 -0.1317 -0.2567 -0.1053 -0.1093 0.1335 0.1255 0.1346 0.1321 0.1148 0.1092 0.0914 0.0967 0.0918 0.1268 0.1077 0.1215 0.1283 0.1162 0.1191
va: 3.5551 2.2475 5.5171 2.0993 2.0909 1.6964 2.0033 3.9431 3.8673 3.9099 3.9299 3.8418 3.8474 1.0151 1.0402 1.0276 1.0167 1.0158 1.0139 1.0035 1.0031 1.0199 0.9897 0.9994 0.9911 0.9903 0.9898 0.9947
dispcorr: -0.011022221 hartree
energy: -1676.516202840937
dipole: -9.68058 10.50088 0.82030 0.33395 0.15324 0.48719 -2.67037 2.02033 -0.65004
magnitude: 1.15447 au
magnitude: 2.93443 debye
