program: Orca
programVersion: 5.0.2
elementType: S S P O O O O C C C C C C H H H H H H H H H H H H H H H
charge: 0
multiplicity: 1
keywords: wb97x-d3
keywords: def2-TZVPP
keywords: def2/J RIJCOSX
keywords: DEFGRID2
keywords: scfconv7
keywords: smallprint printgap noloewdin
keywords: NOSOSCF
formula: C6H15O4PS2
InChI: InChI=1/C6H15O4PS2/c1-4-13(8)6-5-12-11(7,9-2)10-3/h4-6H2,1-3H3
28 atoms
S  -1.864984 -0.800685 -0.456114
S  0.859325 -0.662772 1.506102
P  1.588888 0.693131 0.111714
O  1.243074 0.028949 -1.288533
O  3.160053 0.406415 0.202529
O  -1.795684 0.646277 -0.90021
O  1.169178 2.098495 0.313733
C  -1.929871 -0.760989 1.361431
C  -0.778179 0.039593 1.925172
C  -3.581026 -1.336278 -0.721897
C  -3.88379 -1.393297 -2.205515
C  1.20148 0.794595 -2.498458
C  3.922869 0.908178 1.303557
H  -2.87049 -0.298658 1.671185
H  -1.917673 -1.794176 1.712971
H  -0.821697 1.080897 1.611679
H  -0.841041 0.032245 3.012888
H  -3.68853 -2.316481 -0.252355
H  -4.234175 -0.629832 -0.205548
H  -3.779268 -0.41444 -2.672552
H  -3.232943 -2.095522 -2.727386
H  -4.912127 -1.721798 -2.356255
H  0.88341 1.821861 -2.325295
H  0.486819 0.311826 -3.160375
H  2.184391 0.797249 -2.969241
H  3.578649 0.489391 2.250987
H  3.879367 1.996181 1.355489
H  4.952855 0.600991 1.139266
elementType: S P O C H
totalener: -1676.50237230 hartree
nucrepener: 1329.32036140 hartree
electener: -3005.82273370 hartree
oneelecener: -4955.69427994 hartree
twoeener: 1949.87154624 hartree
cpcmener: -0.03939467 hartree
kineticenergy: 1671.88385347 hartree
xcener: -105.492740796343 hartree
chargesum: -0.0000000
charge: 0.467653 -0.190264 0.843334 -0.335749 -0.361684 -0.672371 -0.612372 -0.172690 -0.081438 -0.125941 -0.256148 -0.116267 -0.106987 0.127725 0.125040 0.115661 0.133988 0.112455 0.109969 0.092603 0.091641 0.097013 0.115397 0.118734 0.130394 0.104922 0.118728 0.126654
qa: 0.4677 -0.1903 0.8433 -0.3357 -0.3617 -0.6724 -0.6124 -0.1727 -0.0814 -0.1259 -0.2561 -0.1163 -0.1070 0.1277 0.1250 0.1157 0.1340 0.1125 0.1100 0.0926 0.0916 0.0970 0.1154 0.1187 0.1304 0.1049 0.1187 0.1267
va: 3.5425 2.2650 5.5261 2.0817 2.0929 1.6977 1.9834 3.9773 3.8621 3.9400 3.9266 3.8414 3.8514 1.0140 1.0222 1.0529 1.0027 1.0143 1.0142 1.0183 1.0043 1.0036 1.0002 0.9900 0.9930 0.9965 0.9948 0.9903
dispcorr: -0.011928947 hartree
energy: -1676.514301244118
dipole: -11.36778 10.38845 -0.97933 -2.65959 0.62112 -2.03847 -3.63381 4.63603 1.00222
magnitude: 2.47364 au
magnitude: 6.28749 debye
