program: Orca
programVersion: 5.0.2
elementType: S S P O O O O C C C C C C H H H H H H H H H H H H H H H
charge: 0
multiplicity: 1
keywords: wb97x-d3
keywords: def2-TZVPP
keywords: def2/J RIJCOSX
keywords: DEFGRID2
keywords: scfconv7
keywords: smallprint printgap noloewdin
keywords: NOSOSCF
formula: C6H15O4PS2
InChI: InChI=1/C6H15O4PS2/c1-4-13(8)6-5-12-11(7,9-2)10-3/h4-6H2,1-3H3
28 atoms
S  -2.59357 0.196899 0.600279
S  0.778116 0.188757 1.000809
P  1.991297 0.105915 -0.690434
O  3.199086 -0.881031 -0.389763
O  2.698349 1.533591 -0.642473
O  -3.217648 -0.520309 1.779195
O  1.292208 -0.2749 -1.936056
C  -1.474274 -1.007781 -0.1740
C  -0.286391 -1.275867 0.723653
C  -3.85602 0.273354 -0.70826
C  -4.64864 -1.004386 -0.878387
C  4.055305 -0.764864 0.749111
C  1.989325 2.721773 -1.014651
H  -2.025592 -1.939056 -0.321272
H  -1.167361 -0.623438 -1.146428
H  -0.610896 -1.585428 1.717927
H  0.310009 -2.095283 0.323734
H  -4.508436 1.0989 -0.416567
H  -3.342711 0.576003 -1.623377
H  -5.466774 -0.828939 -1.577276
H  -4.046815 -1.819191 -1.278656
H  -5.088522 -1.328732 0.063877
H  3.486143 -0.618899 1.668804
H  4.760363 0.05654 0.62463
H  4.605872 -1.699371 0.825662
H  1.442087 2.584076 -1.947252
H  2.733324 3.50232 -1.152379
H  1.296439 3.024367 -0.228945
elementType: S P O C H
totalener: -1676.50395684 hartree
nucrepener: 1285.67904595 hartree
electener: -2962.18300279 hartree
oneelecener: -4866.74481009 hartree
twoeener: 1904.56180730 hartree
cpcmener: -0.03598463 hartree
kineticenergy: 1671.87113175 hartree
xcener: -105.493135660262 hartree
chargesum: -0.0000000
charge: 0.474906 -0.200357 0.838140 -0.342780 -0.346322 -0.681703 -0.611397 -0.193139 -0.099188 -0.111062 -0.273243 -0.106590 -0.108588 0.135494 0.123210 0.134323 0.132379 0.120282 0.109728 0.104488 0.094562 0.087452 0.108980 0.122264 0.126801 0.118624 0.128146 0.114589
qa: 0.4749 -0.2004 0.8381 -0.3428 -0.3463 -0.6817 -0.6114 -0.1931 -0.0992 -0.1111 -0.2732 -0.1066 -0.1086 0.1355 0.1232 0.1343 0.1324 0.1203 0.1097 0.1045 0.0946 0.0875 0.1090 0.1223 0.1268 0.1186 0.1281 0.1146
va: 3.5449 2.2476 5.5162 2.1029 2.0887 1.6982 2.0010 3.9516 3.8709 3.8643 3.9377 3.8397 3.8495 1.0131 1.0351 1.0265 1.0166 1.0034 1.0196 1.0018 0.9968 1.0237 0.9993 0.9908 0.9897 0.9942 0.9909 0.9908
dispcorr: -0.011361233 hartree
energy: -1676.515318075968
dipole: -9.28214 10.04485 0.76270 -1.64287 2.33435 0.69148 -3.14454 2.57980 -0.56474
magnitude: 1.17422 au
magnitude: 2.98463 debye
