program: Orca
programVersion: 5.0.2
elementType: S S P O O O O C C C C C C H H H H H H H H H H H H H H H
charge: 0
multiplicity: 1
keywords: wb97x-d3
keywords: def2-TZVPP
keywords: def2/J RIJCOSX
keywords: DEFGRID2
keywords: scfconv7
keywords: smallprint printgap noloewdin
keywords: NOSOSCF
formula: C6H15O4PS2
InChI: InChI=1/C6H15O4PS2/c1-4-13(8)6-5-12-11(7,9-2)10-3/h4-6H2,1-3H3
28 atoms
S  -3.021568 0.0033 -0.211995
S  1.114503 -0.229621 1.303727
P  2.052898 0.400322 -0.446779
O  3.484466 -0.286302 -0.321325
O  2.396084 1.943863 -0.290422
O  -3.685523 0.276756 1.120746
O  1.271188 0.149126 -1.675712
C  -1.375028 -0.676435 0.160751
C  -0.586902 0.346675 0.952478
C  -3.75905 -1.526094 -0.852485
C  -5.229495 -1.304043 -1.145321
C  3.671355 -1.676628 -0.61695
C  3.179707 2.472478 0.782818
H  -1.499818 -1.601775 0.726619
H  -0.899567 -0.900575 -0.794445
H  -0.544034 1.315635 0.454093
H  -1.036642 0.506836 1.93115
H  -3.20595 -1.798512 -1.753663
H  -3.612899 -2.307363 -0.103743
H  -5.774478 -1.007531 -0.249983
H  -5.381057 -0.542066 -1.910058
H  -5.672657 -2.230831 -1.508518
H  3.133928 -1.970291 -1.51852
H  3.345045 -2.296735 0.218024
H  4.736623 -1.824405 -0.775379
H  2.852552 2.085037 1.749149
H  3.039304 3.550574 0.772537
H  4.236414 2.247923 0.640411
elementType: S P O C H
totalener: -1676.50533705 hartree
nucrepener: 1259.13428640 hartree
electener: -2935.63962346 hartree
oneelecener: -4813.59385262 hartree
twoeener: 1877.95422916 hartree
cpcmener: -0.03531429 hartree
kineticenergy: 1671.86984094 hartree
xcener: -105.490910787180 hartree
chargesum: 0.0000000
charge: 0.477822 -0.199602 0.836618 -0.347552 -0.343042 -0.681207 -0.609448 -0.188341 -0.082111 -0.135389 -0.255793 -0.109159 -0.105116 0.124736 0.126494 0.127391 0.137706 0.114404 0.110625 0.090985 0.093046 0.096638 0.118582 0.116794 0.127821 0.108332 0.127086 0.121678
qa: 0.4778 -0.1996 0.8366 -0.3476 -0.3430 -0.6812 -0.6094 -0.1883 -0.0821 -0.1354 -0.2558 -0.1092 -0.1051 0.1247 0.1265 0.1274 0.1377 0.1144 0.1106 0.0910 0.0930 0.0966 0.1186 0.1168 0.1278 0.1083 0.1271 0.1217
va: 3.5543 2.2496 5.5190 2.0916 2.0995 1.6990 2.0034 3.9431 3.8183 3.9163 3.9284 3.8476 3.8398 1.0168 1.0409 1.0214 1.0279 1.0157 1.0133 1.0210 1.0029 1.0030 0.9952 0.9897 0.9904 1.0001 0.9899 0.9911
dispcorr: -0.010863968 hartree
energy: -1676.516201020265
dipole: -7.74728 9.39878 1.65149 -6.84974 5.44959 -1.40016 -1.19788 1.29944 0.10156
magnitude: 2.16753 au
magnitude: 5.50942 debye
