program: Orca
programVersion: 5.0.2
elementType: S S P O O O O C C C C C C H H H H H H H H H H H H H H H
charge: 0
multiplicity: 1
keywords: wb97x-d3
keywords: def2-TZVPP
keywords: def2/J RIJCOSX
keywords: DEFGRID2
keywords: scfconv7
keywords: smallprint printgap noloewdin
keywords: NOSOSCF
formula: C6H15O4PS2
InChI: InChI=1/C6H15O4PS2/c1-4-13(8)6-5-12-11(7,9-2)10-3/h4-6H2,1-3H3
28 atoms
S  -3.171815 0.068535 0.311238
S  1.134441 -0.201321 1.179826
P  1.995589 0.407046 -0.616273
O  3.416812 -0.310537 -0.538451
O  2.378797 1.942875 -0.482755
O  -3.552691 -0.092412 1.767406
O  1.166327 0.16691 -1.8154
C  -1.449893 -0.513965 0.196143
C  -0.567428 0.436288 0.979746
C  -3.962058 -1.298867 -0.583868
C  -3.700325 -1.255431 -2.07685
C  3.539031 -1.727401 -0.720859
C  3.238604 2.452764 0.540148
H  -1.42027 -1.523786 0.610636
H  -1.161541 -0.544803 -0.854055
H  -0.537135 1.430623 0.533231
H  -0.931623 0.549333 2.001398
H  -3.636075 -2.235431 -0.126366
H  -5.026192 -1.174815 -0.371393
H  -3.948699 -0.283275 -2.504428
H  -2.66428 -1.483424 -2.325177
H  -4.323861 -1.998737 -2.574055
H  4.594017 -1.935213 -0.880495
H  2.973794 -2.069082 -1.587884
H  3.201873 -2.264967 0.165962
H  4.277735 2.193027 0.340682
H  2.953975 2.083488 1.526872
H  3.133261 3.534826 0.528365
elementType: S P O C H
totalener: -1676.50436558 hartree
nucrepener: 1264.93566032 hartree
electener: -2941.44002589 hartree
oneelecener: -4825.02261476 hartree
twoeener: 1883.58258887 hartree
cpcmener: -0.03556487 hartree
kineticenergy: 1671.86286545 hartree
xcener: -105.489877901305 hartree
chargesum: -0.0000000
charge: 0.478814 -0.198764 0.835432 -0.346983 -0.343447 -0.682064 -0.609980 -0.189038 -0.091835 -0.100981 -0.285399 -0.110944 -0.104891 0.121267 0.125653 0.131949 0.135628 0.102202 0.114961 0.094832 0.099193 0.102993 0.127874 0.120609 0.115871 0.121762 0.108437 0.126849
qa: 0.4788 -0.1988 0.8354 -0.3470 -0.3434 -0.6821 -0.6100 -0.1890 -0.0918 -0.1010 -0.2854 -0.1109 -0.1049 0.1213 0.1257 0.1319 0.1356 0.1022 0.1150 0.0948 0.0992 0.1030 0.1279 0.1206 0.1159 0.1218 0.1084 0.1268
va: 3.5710 2.2479 5.5216 2.0884 2.0979 1.7002 2.0049 3.9427 3.8154 3.8734 3.9648 3.8498 3.8395 1.0199 1.0360 1.0179 1.0331 1.0202 1.0107 1.0051 0.9980 0.9998 0.9907 0.9934 0.9895 0.9913 0.9999 0.9902
dispcorr: -0.011090601 hartree
energy: -1676.515456178958
dipole: -4.76349 6.21270 1.44922 -6.07717 5.22138 -0.85579 -3.93704 3.55287 -0.38417
magnitude: 1.72632 au
magnitude: 4.38796 debye
