program: Orca
programVersion: 5.0.2
elementType: S S P O O O O C C C C C C H H H H H H H H H H H H H H H
charge: 0
multiplicity: 1
keywords: wb97x-d3
keywords: def2-TZVPP
keywords: def2/J RIJCOSX
keywords: DEFGRID2
keywords: scfconv7
keywords: smallprint printgap noloewdin
keywords: NOSOSCF
formula: C6H15O4PS2
InChI: InChI=1/C6H15O4PS2/c1-4-13(8)6-5-12-11(7,9-2)10-3/h4-6H2,1-3H3
28 atoms
S  -3.252079 0.185175 0.006792
S  0.883671 -0.178462 1.470573
P  1.897612 0.730693 -0.093244
O  3.028067 -0.342715 -0.470732
O  2.773251 1.838489 0.64517
O  -3.832342 -0.28925 1.306061
O  1.039328 1.189663 -1.20262
C  -1.494679 -0.314369 0.029947
C  -0.810207 0.428293 1.158676
C  -3.811838 -0.972348 -1.297256
C  -3.846859 -2.4157 -0.838668
C  2.678397 -1.46463 -1.271237
C  3.6011 2.706462 -0.128074
H  -1.441914 -1.391038 0.195719
H  -1.049061 -0.061764 -0.931538
H  -0.788151 1.502283 0.979334
H  -1.337772 0.257549 2.097649
H  -4.813474 -0.627605 -1.560502
H  -3.174554 -0.814632 -2.170084
H  -4.340941 -3.032909 -1.588432
H  -2.85011 -2.826042 -0.684263
H  -4.399738 -2.507882 0.09435
H  2.346717 -1.15843 -2.263645
H  1.89144 -2.057659 -0.799166
H  3.570576 -2.078882 -1.364629
H  4.4666 2.173299 -0.523346
H  3.9446 3.491774 0.540282
H  3.048163 3.157917 -0.952624
totalener: -1676.47871737 hartree
nucrepener: 1269.03167466 hartree
electener: -2945.51039203 hartree
oneelecener: -4833.02761185 hartree
twoeener: 1887.51721983 hartree
kineticenergy: 1671.94169010 hartree
xcener: -105.495599357085 hartree
chargesum: -0.0000000
charge: 0.462589 -0.157137 0.794996 -0.331583 -0.322630 -0.574739 -0.533629 -0.224873 -0.108596 -0.141436 -0.264449 -0.119669 -0.140281 0.106056 0.128171 0.122111 0.141523 0.112357 0.090119 0.092981 0.075068 0.111815 0.119208 0.092723 0.119035 0.113991 0.118037 0.118241
qa: 0.4626 -0.1571 0.7950 -0.3316 -0.3226 -0.5747 -0.5336 -0.2249 -0.1086 -0.1414 -0.2644 -0.1197 -0.1403 0.1061 0.1282 0.1221 0.1415 0.1124 0.0901 0.0930 0.0751 0.1118 0.1192 0.0927 0.1190 0.1140 0.1180 0.1182
va: 3.6125 2.2724 5.5221 2.0918 2.1333 1.8314 2.0607 3.9503 3.8444 3.8865 3.9385 3.8784 3.8844 1.0206 1.0389 1.0247 1.0310 1.0056 1.0231 1.0029 1.0013 1.0210 0.9936 0.9990 0.9925 0.9900 0.9895 0.9924
dispcorr: -0.011315941 hartree
energy: -1676.490033310453
dipole: -5.22917 6.32630 1.09712 -7.86816 7.39741 -0.47074 -8.96212 7.65981 -1.30231
magnitude: 1.76672 au
magnitude: 4.49065 debye
