program: Orca
programVersion: 5.0.2
elementType: S S P O O O O C C C C C C H H H H H H H H H H H H H H H
charge: 0
multiplicity: 1
keywords: wb97x-d3
keywords: def2-TZVPP
keywords: def2/J RIJCOSX
keywords: DEFGRID2
keywords: scfconv7
keywords: smallprint printgap noloewdin
keywords: NOSOSCF
formula: C6H15O4PS2
InChI: InChI=1/C6H15O4PS2/c1-4-13(8)6-5-12-11(7,9-2)10-3/h4-6H2,1-3H3
28 atoms
S  -3.117945 0.151579 -0.378961
S  0.852164 0.049748 1.531895
P  1.967557 0.501095 -0.155922
O  2.112004 -0.910699 -0.891094
O  3.443455 0.688841 0.438323
O  -3.810323 0.062679 0.948422
O  1.433746 1.610258 -0.967548
C  -1.379069 -0.340803 -0.081832
C  -0.794323 0.588568 0.962043
C  -3.616233 -1.319674 -1.349465
C  -3.750229 -2.571424 -0.50608
C  2.744208 -0.973159 -2.168405
C  3.784806 1.920131 1.067049
H  -1.347699 -1.373698 0.265307
H  -0.849105 -0.261453 -1.032097
H  -0.727801 1.613511 0.600427
H  -1.415344 0.579893 1.858246
H  -4.577348 -1.048096 -1.789767
H  -2.903283 -1.430365 -2.169503
H  -4.383243 -2.385214 0.359433
H  -4.20553 -3.367947 -1.093986
H  -2.788682 -2.938136 -0.150235
H  3.814487 -0.779123 -2.088727
H  2.302357 -0.26401 -2.868919
H  2.597416 -1.983283 -2.542524
H  3.185376 2.082358 1.964583
H  3.647897 2.763773 0.39092
H  4.831742 1.850801 1.349542
totalener: -1676.47843127 hartree
nucrepener: 1272.55180077 hartree
electener: -2949.03023204 hartree
oneelecener: -4840.05141696 hartree
twoeener: 1891.02118493 hartree
kineticenergy: 1671.93906916 hartree
xcener: -105.494026022699 hartree
chargesum: 0.0000000
charge: 0.464193 -0.159403 0.780858 -0.325005 -0.341377 -0.572804 -0.522411 -0.198601 -0.123942 -0.146607 -0.259451 -0.134393 -0.121747 0.114382 0.105403 0.130965 0.139667 0.113268 0.088604 0.111112 0.092792 0.076547 0.114905 0.118067 0.116528 0.100848 0.120855 0.116744
qa: 0.4642 -0.1594 0.7809 -0.3250 -0.3414 -0.5728 -0.5224 -0.1986 -0.1239 -0.1466 -0.2595 -0.1344 -0.1217 0.1144 0.1054 0.1310 0.1397 0.1133 0.0886 0.1111 0.0928 0.0765 0.1149 0.1181 0.1165 0.1008 0.1209 0.1167
va: 3.6086 2.2820 5.5352 2.0827 2.1037 1.8333 2.0810 3.9222 3.8773 3.8936 3.9379 3.8751 3.8729 1.0209 1.0390 1.0272 1.0292 1.0052 1.0217 1.0213 1.0023 1.0029 0.9920 0.9943 0.9887 0.9972 0.9947 0.9907
dispcorr: -0.011362796 hartree
energy: -1676.489794062936
dipole: -4.29827 5.41289 1.11462 -7.25484 6.49176 -0.76308 -6.02481 5.03733 -0.98748
magnitude: 1.67326 au
magnitude: 4.25308 debye
