program: Orca
programVersion: 5.0.2
elementType: S S P O O O O C C C C C C H H H H H H H H H H H H H H H
charge: 0
multiplicity: 1
keywords: wb97x-d3
keywords: def2-TZVPP
keywords: def2/J RIJCOSX
keywords: DEFGRID2
keywords: scfconv7
keywords: smallprint printgap noloewdin
keywords: NOSOSCF
formula: C6H15O4PS2
InChI: InChI=1/C6H15O4PS2/c1-4-13(8)6-5-12-11(7,9-2)10-3/h4-6H2,1-3H3
28 atoms
S  -3.152856 0.276257 0.392536
S  1.113535 -0.518044 1.38415
P  1.873955 0.320377 -0.356924
O  3.403435 -0.154646 -0.374568
O  2.045197 1.858073 0.038061
O  -3.59627 -0.793863 1.344305
O  1.086211 0.02353 -1.569593
C  -1.360893 0.52729 0.664666
C  -0.613439 -0.775127 0.850146
C  -3.048856 -0.48347 -1.265721
C  -4.435792 -0.913384 -1.704712
C  3.726914 -1.452848 -0.859257
C  2.610044 2.772187 -0.899447
H  -0.980141 1.105148 -0.178067
H  -1.283032 1.142001 1.562542
H  -1.074595 -1.364361 1.64293
H  -0.601741 -1.376102 -0.055279
H  -2.617362 0.260984 -1.937895
H  -2.375005 -1.339636 -1.225657
H  -5.120463 -0.067658 -1.769364
H  -4.38865 -1.380117 -2.688042
H  -4.853806 -1.638462 -1.008368
H  3.244011 -2.2297 -0.262717
H  4.805065 -1.563226 -0.77251
H  3.434836 -1.571999 -1.902712
H  2.146989 2.678801 -1.882701
H  3.686098 2.621836 -0.992039
H  2.424614 3.772052 -0.515019
totalener: -1676.47964873 hartree
nucrepener: 1278.62357548 hartree
electener: -2955.10322421 hartree
oneelecener: -4852.18526698 hartree
twoeener: 1897.08204277 hartree
kineticenergy: 1671.93337444 hartree
xcener: -105.494755831819 hartree
chargesum: 0.0000000
charge: 0.457441 -0.156008 0.786145 -0.341582 -0.320469 -0.575160 -0.530194 -0.173488 -0.122667 -0.165685 -0.255041 -0.120579 -0.135994 0.104490 0.127670 0.140102 0.113404 0.099490 0.104974 0.084873 0.086069 0.106796 0.099685 0.116721 0.120445 0.114762 0.115629 0.118169
qa: 0.4574 -0.1560 0.7861 -0.3416 -0.3205 -0.5752 -0.5302 -0.1735 -0.1227 -0.1657 -0.2550 -0.1206 -0.1360 0.1045 0.1277 0.1401 0.1134 0.0995 0.1050 0.0849 0.0861 0.1068 0.0997 0.1167 0.1204 0.1148 0.1156 0.1182
va: 3.6222 2.2869 5.5171 2.1000 2.0992 1.8300 2.0659 3.8751 3.8834 3.9291 3.9316 3.8774 3.8806 1.0443 1.0148 1.0276 1.0300 1.0207 1.0154 1.0066 1.0028 1.0184 0.9976 0.9908 0.9945 0.9931 0.9916 0.9891
dispcorr: -0.011710324 hartree
energy: -1676.491359051966
dipole: -4.83031 6.17423 1.34392 -1.81191 2.29426 0.48236 -10.24777 9.14014 -1.10763
magnitude: 1.80711 au
magnitude: 4.59330 debye
